{"text_format":"1","workbook":"xlsx","n_sheets":5,"sheets":["收盤行情","費率","交易紀錄","損益彙算","持股市值與損益圖表"],"not_rendered":{"charts":2,"images":0,"macros":1,"external_links":0,"defined_names":15,"comments":0,"pivot_tables":1},"unopened":[{"sheet":"持股市值與損益圖表","index":4,"reason":"not_a_worksheet"}],"bounds":{"document_bytes":16777216,"sheet_cells":100000,"rows_first":2000,"rows_last":500,"rows_between":2000,"halvings":0,"cell_chars":16384,"cell_head_chars":4096},"cells_cut":0,"cells_raw":0,"read":"whole","date_system":"1900"}

{"sheet":"收盤行情","index":0,"n_rows":1378,"n_cols":9,"rows_kept":1378,"cut":false,"hidden":false,"merged":[[0,0,1,8],[2,2,2,3]]}
["報價日期 : 2009/7/6下午 02:00:00 "]
[]
["代號 ","名稱","漲跌",null,"收盤 ","開盤","最高 ","最低 ","總量"]
[15,"富 邦","▼",-0.02,6.34,6.37,6.4,6.3,606]
[50,"台灣50","▼",-0.11,45.69,45.8,45.9,45.36,10655]
[51,"中100","▲",0.28999999999999998,25.24,25.05,25.4,25,167]
[52,"富邦IT","▲",0.11,28.12,28.01,28.12,28.01,10]
[53,"寶電子","▼",-0.08,20.36,20.5,20.5,20.309999999999999,80]
[54,"台商50","▼",-0.03,16.510000000000002,16.75,16.75,16.329999999999998,59]
[55,"寶金融","▼",-0.13,11.76,11.88,11.89,11.61,2858]
[56,"高股息","▲",0.01,20.11,20.100000000000001,20.25,20,467]
[57,"FB摩台","▼",-0.03,24.47,24.45,24.47,24.41,181]
[58,"FB發達","▼",-0.4,24.81,24.81,24.81,24.81,2]
[59,"FB金融","▼",-0.17,24.27,24.44,24.44,24.27,38]
[60,"新台灣","▼",-0.1,22.6,22.5,22.6,22.48,114]
[1000,"加 權","▼",-15.49,6649.91,6691.02,6693.44,6615.9,3909942]
[1001,"不含金","▼",-5.0599999999999996,5551.59,5577.82,5581.98,5524.77,3909942]
[1002,"水泥類","▲",2.82,432.4,431.3,435.53,427.89,3909942]
[1003,"食品類","▲",0.02,638.66999999999996,642.19000000000005,645.66,634.9,3909942]
[1004,"塑化類","▼",-0.55000000000000004,533.69000000000005,535.79999999999995,536.04999999999995,530.04,3909942]
[1005,"紡織類","▲",4.9800000000000004,353.86,351.71,364.55,349.02,3909942]
[1006,"機電類","▼",-4.62,1459.73,1469.51,1470.16,1453.32,3909942]
[1007,"造紙類","▲",2.88,176.83,175.05,179.19,174.44,3909942]
[1008,"營建類","▲",4.83,292.91000000000003,292,297.42,289.64,3909942]
[1009,"金融類","▼",-8.7899999999999991,822.85,835,835,816.33,3909942]
[1010,"不含電","▼",-9.9209999999999994,9597.8189999999995,9648.1299999999992,9652.5290000000005,9538.7999999999993,3909942]
[1011,"水 泥","▲",1,110.05,109.52,110.88,108.73,33893]
[1012,"食 品","▲",0.02,638.66999999999996,642.19000000000005,645.66,634.9,93341]
[1013,"塑 膠","▼",-1.6,146.68,148.38999999999999,148.38999999999999,145.76,86834]
[1014,"紡 織","▲",4.9800000000000004,353.86,351.71,364.55,349.02,123254]
[1015,"電 機","▲",1.05,65.66,64.77,65.8,64.41,72942]
[1016,"電 器","▲",0.01,41.58,41.87,41.93,41.19,44100]
[1017,"化生醫","▲",1.87,91.67,90.62,91.8,89.82,124463]
[1018,"玻 璃","▼",-0.26,43.73,44.11,44.3,43.39,3704]
[1019,"造 紙","▲",2.88,176.83,175.05,179.19,174.44,25788]
[1020,"鋼 鐵","▼",-0.28000000000000003,97.17,97.72,97.73,96.58,98079]
[1021,"橡 膠","▲",3.13,179.67,177.4,181.72,176.6,61819]
[1022,"汽 車","▲",3.63,112.54,109.65,112.69,109.44,128779]
[1023,"電 子","▼",-0.92,261.51,263.35000000000002,263.45999999999998,260.39999999999998,1434006]
[1025,"營 造","▲",4.83,292.91000000000003,292,297.42,289.64,303056]
[1026,"運 輸","▲",1.45,88.18,87.1,88.87,86.55,165661]
[1027,"觀 光","▼",-0.57999999999999996,132.49,134.07,134.61000000000001,132.44999999999999,11906]
[1028,"金 融","▼",-8.7899999999999991,822.85,835,835,816.33,613548]
[1029,"百 貨","▲",2.09,125.41,123.56,125.86,123.1,76924]
[1099,"其 他","▲",0.99,118.09,117.74,118.51,116.97,84374]
[1101,"台 泥","▲",0.2,32.200000000000003,32,32.65,31.9,10155]
[1102,"亞 泥","▲",0.25,35,34.799999999999997,35.35,34.549999999999997,17211]
[1103,"嘉 泥","▲",0.65,16.100000000000001,15.5,16.2,15.5,2943]
[1104,"環 泥",null,0,15,15.1,15.2,14.9,824]
[1107,"建 台","▼",-0.06,1.1200000000000001,1.17,1.17,1.1200000000000001,105]
[1108,"幸 福","▲",0.15,7.26,7.1,7.28,7.1,630]
[1109,"信 大",null,0,9.4,9.4,9.4600000000000009,9.39,91]
[1110,"東 泥","▲",0.5,12.4,12,12.6,11.9,2039]
[1201,"味 全","▲",0.35,43.35,43,44.3,42.5,19723]
[1203,"味 王","▲",0.65,27.5,27,27.95,26.5,6165]
[1210,"大 成","▼",-0.4,37.6,38.049999999999997,38.200000000000003,37.6,5696]
[1213,"大 飲","▲",0.12,9,8.8800000000000008,9.11,8.7799999999999994,68]
[1215,"卜 蜂","▲",0.25,17.600000000000001,17.45,17.600000000000001,17.2,3379]
[1216,"統 一","▼",-0.2,35.700000000000003,36.1,36.35,35.549999999999997,17354]
[1217,"愛之味","▲",0.05,11.95,12,12.15,11.8,14495]
{"$rows_left_out":1319}
{"sheet":"費率","index":1,"n_rows":9,"n_cols":6,"rows_kept":9,"cut":false,"hidden":false,"merged":[]}
["券商手續費率",{"$f":"D1/1000000","v":1.4250000000000001E-3},null,1425,null,"買賣方式"]
["證券交易稅率",{"$f":"D2/1000","v":3.0000000000000001E-3},null,3,null,"普通"]
["上市融資成數",{"$f":"D3/100","v":0.6},null,60,null,"融資"]
["上櫃融資成數",{"$f":"D4/100","v":0.5},null,50,null,"融券"]
["上市融券成數",{"$f":"D5/100","v":0.9},null,90]
["上櫃融券成數",{"$f":"D6/100","v":0.9},null,90]
["融資利率",{"$f":"D7/10000","v":6.6500000000000004E-2},null,665]
["融券手續費率",{"$f":"D8/10000","v":8.0000000000000004E-4},null,8]
["擔保品保證金利率",{"$f":"D9/1000","v":3.0000000000000001E-3},null,3]

{"sheet":"交易紀錄","index":2,"n_rows":80,"n_cols":23,"rows_kept":80,"cut":false,"hidden":false,"merged":[]}
["編號","日期","股票代號","股票名稱","買賣方式","買入股數","買入單價","賣出股數","賣出單價","總價","手續費","證交稅","融資自備款","融資金額","融資利息費用","融券手續費","融券利息收入","買入總成本","保證金","(融券擔保品)賣出淨額",null,"買賣方式","買入股數"]
["2330-1","2009-06-05",2330,{"$f":"IF(C2=\"\",\"\",VLOOKUP(C2,股票收盤資料區,2,FALSE))","v":"台積電"},"融資",23000,40,null,null,{"$f":"IF(C2=\"\",\"\",F2*G2+H2*I2)","v":920000},{"$f":"IF(C2=\"\",\"\",J2*券商手續費率)","v":1311},{"$f":"IF(C2=\"\",\"\",IF(H2>0,J2*證券交易稅率,\"\"))","v":""},{"$f":"IF(C2=\"\",\"\",IF(AND(E2=\"融資\",F2>0),J2-N2,\"\"))","v":368000},{"$f":"IF(C2=\"\",\"\",IF(AND(E2=\"融資\",F2>0),1000*INT(J2*IF(ISNA(VLOOKUP(C2,上櫃代碼,1,FALSE)),上市融資成數,上櫃融資成數)/1000),\"\"))","v":552000},{"$f":"IF(C2=\"\",\"\",IF(AND(E2=\"融資\",H2>0),H2/VLOOKUP(A2,交易內容,6,0)*VLOOKUP(A2,交易內容,14,0)*融資利率*IF(B2-VLOOKUP(A2,交易內容,2,0)<2,1,B2-VLOOKUP(A2,交易內容,2,0))/365,\"\"))","v":""},{"$f":"IF(C2=\"\",\"\",IF(AND(E2=\"融券\",H2>0),J2*融券手續費率,\"\"))","v":""},{"$f":"IF(C2=\"\",\"\",IF(AND(E2=\"融券\",F2>0),F2/VLOOKUP(A2,交易內容,8,0)*(VLOOKUP(A2,交易內容,19,0)+VLOOKUP(A2,交易內容,20,0))*擔保品保證金利率*IF(B2-VLOOKUP(A2,交易內容,2,0)<2,1,B2-VLOOKUP(A2,交易內容,2,0))/365,\"\"))","v":""},{"$f":"IF(C2=\"\",\"\",IF(AND(E2=\"融券\",F2>0),J2+K2-Q2,IF(F2>0,J2+K2,\"\")))","v":921311},{"$f":"IF(C2=\"\",\"\",IF(AND(E2=\"融券\",H2>0),J2*IF(ISNA(VLOOKUP(C2,上櫃代碼,1,0)),上市融券成數,上櫃融券成數),\"\"))","v":""},{"$f":"IF(C2=\"\",\"\",IF(H2>0,IF(E2=\"融券\",J2-K2-L2-P2,IF(E2=\"融資\",J2-K2-L2-O2,J2-K2-L2)),\"\"))","v":""},null,"普通",">0"]
["2330-1","2009-06-07",2330,"台積電","融資",null,null,10000,41,{"$f":"IF(C3=\"\",\"\",F3*G3+H3*I3)","v":410000},584.25,1230,{"$f":"IF(C3=\"\",\"\",IF(AND(E3=\"融資\",F3>0),J3-N3,\"\"))","v":""},"",87.452054794520549,"","",{"$f":"IF(C3=\"\",\"\",IF(AND(E3=\"融券\",F3>0),J3+K3-Q3,IF(F3>0,J3+K3,\"\")))","v":""},"",{"$f":"IF(C3=\"\",\"\",IF(H3>0,IF(E3=\"融券\",J3-K3-L3-P3,IF(E3=\"融資\",J3-K3-L3-O3,J3-K3-L3)),\"\"))","v":408098.29794520547}]
["2330-1","2009-06-09",2330,"台積電","融資",null,null,13000,43,559000,{"$f":"IF(C4=\"\",\"\",J4*券商手續費率)","v":796.57500000000005},1677,{"$f":"IF(C4=\"\",\"\",IF(AND(E4=\"融資\",F4>0),J4-N4,\"\"))","v":""},"",227.37534246575342,"","","","",{"$f":"IF(C4=\"\",\"\",IF(H4>0,IF(E4=\"融券\",J4-K4-L4-P4,IF(E4=\"融資\",J4-K4-L4-O4,J4-K4-L4)),\"\"))","v":556299.04965753434}]
["2301-0","2009-06-11",2301,"光寶科","普通",2000,30,null,null,60000,85.5,"","","","","","",60085.5,"",{"$f":"IF(C5=\"\",\"\",IF(H5>0,IF(E5=\"融券\",J5-K5-L5-P5,IF(E5=\"融資\",J5-K5-L5-O5,J5-K5-L5)),\"\"))","v":""}]
["2301-0","2009-06-13",2301,"光寶科","普通",null,null,1000,32,{"$f":"IF(C6=\"\",\"\",F6*G6+H6*I6)","v":32000},45.6,96,"","","","","","","",31858.400000000001]
["1101-1","2009-06-15",1101,"台 泥","融資",18000,13,null,null,234000,333.45,"",94000,140000,"","","",234333.45,"",""]
["1104-1","2009-05-17",1104,"環 泥","融券",null,null,9000,10,90000,128.25,270,"","","",72,"","",81000,89529.75]
["1104-1","2009-05-19",1104,"環 泥","融券",9000,12,null,null,108000,153.9,"","","","","",2.8032287671232878,108151.09677123287,"",""]
["2801-1","2009-05-21",2801,"彰 銀","融資",14000,17,null,null,238000,339.15000000000003,"",96000,142000,"","","",238339.15,"",""]
["2801-1","2009-05-23",2801,"彰 銀","融資",null,null,14000,25,350000,498.75,1050,"","",51.742465753424661,"","","","",348399.5075342466]
["1217-1","2009-05-25",1217,"愛之味","融券",null,null,5000,8,40000,57,120,"","","",32,"","",36000,39791]
["2002-1","2009-05-27",2002,"中 鋼","融券",null,null,10000,31,310000,441.75,930,"","","",248,"","",279000,308380.25]
["2356-0","2009-05-29",2356,"英業達","普通",21000,17,null,null,357000,508.72500000000002,"","","","","","",357508.72499999998,"",""]
["5301-0","2009-05-31",5301,"祥裕電","普通",8000,7,null,null,56000,79.8,"","","","","","",56079.8,"",""]
["2356-0","2009-06-02",2356,"英業達","普通",null,null,3000,18,54000,76.95,162,"","","","","","","",53761.05]
["2801-2","2009-06-04",2801,"彰 銀","融資",15000,17,null,null,255000,363.375,"",102000,153000,"","","",255363.375,"",""]
["2303-1","2009-06-06",2303,"聯 電","融券",null,null,9000,20,180000,256.5,540,"","","",144,"","",162000,179059.5]
["2002-1","2009-06-08",2002,"中 鋼","融券",5000,25,null,null,125000,178.125,"","","","","",28.966697260273971,125149.15830273973,"",""]
["2301-0","2009-06-10",2301,"光寶科","普通",15000,31,null,null,465000,662.625,"","","","","","",465662.625,"",""]
["2330-2","2009-06-12",2330,"台積電","融資",13000,42,null,null,546000,778.05000000000007,"",219000,327000,"","","",546778.05000000005,"",""]
["2330-2","2009-06-14",2330,"台積電","融資",null,null,13000,42.5,552500,787.3125,1657.5,"","",119.15342465753425,"","","","",549936.03407534247]
["2330-0","2009-06-16",2330,"台積電","普通",3000,43,null,null,129000,183.82500000000002,"","","","","","",129183.825,"",""]
["2303-1","2009-06-18",2303,"聯 電","融券",5000,18,null,null,90000,128.25,"","","","","",18.688191780821921,90109.56180821918,"",""]
["2303-0","2009-06-20",2303,"聯 電","普通",10000,22,null,null,220000,313.5,"","","","","","",220313.5,"",""]
["2303-0","2009-06-22",2303,"聯 電","普通",null,null,5000,20,{"$f":"IF(C26=\"\",\"\",F26*G26+H26*I26)","v":100000},142.5,300,"","","","","","","",99557.5]
[null,null,null,{"$f":"IF(C27=\"\",\"\",VLOOKUP(C27,股票代碼區,2,FALSE))","v":""},null,null,null,null,null,{"$f":"IF(C27=\"\",\"\",F27*G27+H27*I27)","v":""},{"$f":"IF(C27=\"\",\"\",J27*券商手續費率)","v":""},{"$f":"IF(C27=\"\",\"\",IF(H27>0,J27*證券交易稅率,\"\"))","v":""},"","",{"$f":"IF(C27=\"\",\"\",IF(AND(E27=\"融資\",H27>0),H27/VLOOKUP(A27,交易內容,6,0)*VLOOKUP(A27,交易內容,14,0)*融資利率*IF(B27-VLOOKUP(A27,交易內容,2,0)<2,1,B27-VLOOKUP(A27,交易內容,2,0))/365,\"\"))","v":""},{"$f":"IF(C27=\"\",\"\",IF(AND(E27=\"融券\",H27>0),J27*融券手續費率,\"\"))","v":""},"","","",""]
[null,null,null,"",null,null,null,null,null,"","","","","","","","","","",""]
[null,null,null,"",null,null,null,null,null,"","","","","","","","","","",""]
[null,null,null,"",null,null,null,null,null,"","","","","","","","","","",""]
[null,null,null,"",null,null,null,null,null,"","","","","","","","","","",""]
[null,null,null,"",null,null,null,null,null,"","","","","","","","","","",""]
[null,null,null,"",null,null,null,null,null,"","","","","","","","","","",""]
[null,null,null,"",null,null,null,null,null,"","","","",{"$f":"IF(C34=\"\",\"\",IF(AND(E34=\"融資\",F34>0),1000*INT(J34*IF(ISNA(VLOOKUP(C34,上櫃代碼,1,FALSE)),上市融資成數,上櫃融資成數)/1000),\"\"))","v":""},"","",{"$f":"IF(C34=\"\",\"\",IF(AND(E34=\"融券\",F34>0),F34/VLOOKUP(A34,交易內容,8,0)*(VLOOKUP(A34,交易內容,19,0)+VLOOKUP(A34,交易內容,20,0))*擔保品保證金利率*IF(B34-VLOOKUP(A34,交易內容,2,0)<2,1,B34-VLOOKUP(A34,交易內容,2,0))/365,\"\"))","v":""},"",{"$f":"IF(C34=\"\",\"\",IF(AND(E34=\"融券\",H34>0),J34*IF(ISNA(VLOOKUP(C34,上櫃代碼,1,0)),上市融券成數,上櫃融券成數),\"\"))","v":""},""]
[null,null,null,"",null,null,null,null,null,"","","","","","","","","","",""]
[null,null,null,"",null,null,null,null,null,"","","","","","","","","","",""]
[null,null,null,"",null,null,null,null,null,"","","","","","","","","","",""]
[null,null,null,"",null,null,null,null,null,"","","","","","","","","","",""]
[null,null,null,"",null,null,null,null,null,"","","","","","","","","","",""]
[null,null,null,"",null,null,null,null,null,"","","","","","","","","","",""]
[null,null,null,"",null,null,null,null,null,"","","","","","","","","","",""]
[null,null,null,"",null,null,null,null,null,"","","","","","","","","","",""]
[null,null,null,"",null,null,null,null,null,"","","","","","","","","","",""]
[null,null,null,"",null,null,null,null,null,"","","","","","","","","","",""]
[null,null,null,"",null,null,null,null,null,"","","","","","","","","","",""]
[null,null,null,"",null,null,null,null,null,"","","","","","","","","","",""]
[null,null,null,"",null,null,null,null,null,"","","","","","","","","","",""]
[null,null,null,"",null,null,null,null,null,"","","","","","","","","","",""]
[null,null,null,"",null,null,null,null,null,"","","","","","","","","","",""]
[null,null,null,null,null,null,null,null,null,"","","","","","","","","","",""]
[null,null,null,null,null,null,null,null,null,{"$f":"DSUM(交易內容,10,V1:W2)","v":1287000},null,null,{"$f":"SUM(M2:M50)","v":879000},null,null,null,{"$f":"IF(C51=\"\",\"\",IF(E51<>\"券買\",\"\",(F51*VLOOKUP(VLOOKUP(A51,費率!$Q$21:$T$29,4,FALSE),交易內容,7,FALSE)*IF(ISERROR(VLOOKUP(C51,上櫃代碼,1,FALSE)),上市融券成數,上櫃融券成數)+((F51/VLOOKUP(VLOOKUP(A51,費率!$Q$21:$T$29,4,FALSE),交易內容,6,FALSE))*VLOOKUP(VLOOKUP(A51,費率!$Q$21:$T$29,4,FALSE),交易內容,18,FALSE)))*擔保金保證金利率*IF(B51-VLOOKUP(A51,費率!$Q$21:$T$29,4,FALSE)<2,1,(B51-VLOOKUP(A51,費率!$Q$21:$T$29,4,FALSE)))/365))","v":""},null,{"$f":"SUM(S2:S50)","v":558000},{"$f":"J51+M51+S51","v":2724000}]
[null,null,null,null,null,null,null,null,null,null,null,null,null,null,null,null,{"$f":"IF(C52=\"\",\"\",IF(E52<>\"券買\",\"\",(F52*VLOOKUP(VLOOKUP(A52,費率!$Q$21:$T$29,4,FALSE),交易內容,7,FALSE)*IF(ISERROR(VLOOKUP(C52,上櫃代碼,1,FALSE)),上市融券成數,上櫃融券成數)+((F52/VLOOKUP(VLOOKUP(A52,費率!$Q$21:$T$29,4,FALSE),交易內容,6,FALSE))*VLOOKUP(VLOOKUP(A52,費率!$Q$21:$T$29,4,FALSE),交易內容,18,FALSE)))*擔保金保證金利率*IF(B52-VLOOKUP(A52,費率!$Q$21:$T$29,4,FALSE)<2,1,(B52-VLOOKUP(A52,費率!$Q$21:$T$29,4,FALSE)))/365))","v":""}]
[null,null,null,null,null,null,null,null,null,null,null,null,null,null,null,null,{"$f":"IF(C53=\"\",\"\",IF(E53<>\"券買\",\"\",(F53*VLOOKUP(VLOOKUP(A53,費率!$Q$21:$T$29,4,FALSE),交易內容,7,FALSE)*IF(ISERROR(VLOOKUP(C53,上櫃代碼,1,FALSE)),上市融券成數,上櫃融券成數)+((F53/VLOOKUP(VLOOKUP(A53,費率!$Q$21:$T$29,4,FALSE),交易內容,6,FALSE))*VLOOKUP(VLOOKUP(A53,費率!$Q$21:$T$29,4,FALSE),交易內容,18,FALSE)))*擔保金保證金利率*IF(B53-VLOOKUP(A53,費率!$Q$21:$T$29,4,FALSE)<2,1,(B53-VLOOKUP(A53,費率!$Q$21:$T$29,4,FALSE)))/365))","v":""}]
[null,null,null,null,null,null,null,null,null,null,null,null,null,null,null,null,{"$f":"IF(C54=\"\",\"\",IF(E54<>\"券買\",\"\",(F54*VLOOKUP(VLOOKUP(A54,費率!$Q$21:$T$29,4,FALSE),交易內容,7,FALSE)*IF(ISERROR(VLOOKUP(C54,上櫃代碼,1,FALSE)),上市融券成數,上櫃融券成數)+((F54/VLOOKUP(VLOOKUP(A54,費率!$Q$21:$T$29,4,FALSE),交易內容,6,FALSE))*VLOOKUP(VLOOKUP(A54,費率!$Q$21:$T$29,4,FALSE),交易內容,18,FALSE)))*擔保金保證金利率*IF(B54-VLOOKUP(A54,費率!$Q$21:$T$29,4,FALSE)<2,1,(B54-VLOOKUP(A54,費率!$Q$21:$T$29,4,FALSE)))/365))","v":""}]
[null,null,null,null,null,null,null,null,null,null,null,null,null,null,null,null,{"$f":"IF(C55=\"\",\"\",IF(E55<>\"券買\",\"\",(F55*VLOOKUP(VLOOKUP(A55,費率!$Q$21:$T$29,4,FALSE),交易內容,7,FALSE)*IF(ISERROR(VLOOKUP(C55,上櫃代碼,1,FALSE)),上市融券成數,上櫃融券成數)+((F55/VLOOKUP(VLOOKUP(A55,費率!$Q$21:$T$29,4,FALSE),交易內容,6,FALSE))*VLOOKUP(VLOOKUP(A55,費率!$Q$21:$T$29,4,FALSE),交易內容,18,FALSE)))*擔保金保證金利率*IF(B55-VLOOKUP(A55,費率!$Q$21:$T$29,4,FALSE)<2,1,(B55-VLOOKUP(A55,費率!$Q$21:$T$29,4,FALSE)))/365))","v":""}]
[null,null,null,null,null,null,null,null,null,null,null,null,null,null,null,null,{"$f":"IF(C56=\"\",\"\",IF(E56<>\"券買\",\"\",(F56*VLOOKUP(VLOOKUP(A56,費率!$Q$21:$T$29,4,FALSE),交易內容,7,FALSE)*IF(ISERROR(VLOOKUP(C56,上櫃代碼,1,FALSE)),上市融券成數,上櫃融券成數)+((F56/VLOOKUP(VLOOKUP(A56,費率!$Q$21:$T$29,4,FALSE),交易內容,6,FALSE))*VLOOKUP(VLOOKUP(A56,費率!$Q$21:$T$29,4,FALSE),交易內容,18,FALSE)))*擔保金保證金利率*IF(B56-VLOOKUP(A56,費率!$Q$21:$T$29,4,FALSE)<2,1,(B56-VLOOKUP(A56,費率!$Q$21:$T$29,4,FALSE)))/365))","v":""}]
[null,null,null,null,null,null,null,null,null,null,null,null,null,null,null,null,{"$f":"IF(C57=\"\",\"\",IF(E57<>\"券買\",\"\",(F57*VLOOKUP(VLOOKUP(A57,費率!$Q$21:$T$29,4,FALSE),交易內容,7,FALSE)*IF(ISERROR(VLOOKUP(C57,上櫃代碼,1,FALSE)),上市融券成數,上櫃融券成數)+((F57/VLOOKUP(VLOOKUP(A57,費率!$Q$21:$T$29,4,FALSE),交易內容,6,FALSE))*VLOOKUP(VLOOKUP(A57,費率!$Q$21:$T$29,4,FALSE),交易內容,18,FALSE)))*擔保金保證金利率*IF(B57-VLOOKUP(A57,費率!$Q$21:$T$29,4,FALSE)<2,1,(B57-VLOOKUP(A57,費率!$Q$21:$T$29,4,FALSE)))/365))","v":""}]
[null,null,null,null,null,null,null,null,null,null,null,null,null,null,null,null,{"$f":"IF(C58=\"\",\"\",IF(E58<>\"券買\",\"\",(F58*VLOOKUP(VLOOKUP(A58,費率!$Q$21:$T$29,4,FALSE),交易內容,7,FALSE)*IF(ISERROR(VLOOKUP(C58,上櫃代碼,1,FALSE)),上市融券成數,上櫃融券成數)+((F58/VLOOKUP(VLOOKUP(A58,費率!$Q$21:$T$29,4,FALSE),交易內容,6,FALSE))*VLOOKUP(VLOOKUP(A58,費率!$Q$21:$T$29,4,FALSE),交易內容,18,FALSE)))*擔保金保證金利率*IF(B58-VLOOKUP(A58,費率!$Q$21:$T$29,4,FALSE)<2,1,(B58-VLOOKUP(A58,費率!$Q$21:$T$29,4,FALSE)))/365))","v":""}]
[null,null,null,null,null,null,null,null,null,null,null,null,null,null,null,null,{"$f":"IF(C59=\"\",\"\",IF(E59<>\"券買\",\"\",(F59*VLOOKUP(VLOOKUP(A59,費率!$Q$21:$T$29,4,FALSE),交易內容,7,FALSE)*IF(ISERROR(VLOOKUP(C59,上櫃代碼,1,FALSE)),上市融券成數,上櫃融券成數)+((F59/VLOOKUP(VLOOKUP(A59,費率!$Q$21:$T$29,4,FALSE),交易內容,6,FALSE))*VLOOKUP(VLOOKUP(A59,費率!$Q$21:$T$29,4,FALSE),交易內容,18,FALSE)))*擔保金保證金利率*IF(B59-VLOOKUP(A59,費率!$Q$21:$T$29,4,FALSE)<2,1,(B59-VLOOKUP(A59,費率!$Q$21:$T$29,4,FALSE)))/365))","v":""}]
[null,null,null,null,null,null,null,null,null,null,null,null,null,null,null,null,{"$f":"IF(C60=\"\",\"\",IF(E60<>\"券買\",\"\",(F60*VLOOKUP(VLOOKUP(A60,費率!$Q$21:$T$29,4,FALSE),交易內容,7,FALSE)*IF(ISERROR(VLOOKUP(C60,上櫃代碼,1,FALSE)),上市融券成數,上櫃融券成數)+((F60/VLOOKUP(VLOOKUP(A60,費率!$Q$21:$T$29,4,FALSE),交易內容,6,FALSE))*VLOOKUP(VLOOKUP(A60,費率!$Q$21:$T$29,4,FALSE),交易內容,18,FALSE)))*擔保金保證金利率*IF(B60-VLOOKUP(A60,費率!$Q$21:$T$29,4,FALSE)<2,1,(B60-VLOOKUP(A60,費率!$Q$21:$T$29,4,FALSE)))/365))","v":""}]
{"$rows_left_out":21}
{"sheet":"損益彙算","index":3,"n_rows":31,"n_cols":12,"rows_kept":31,"cut":false,"hidden":false,"merged":[]}
[null,null,null,null,null,null,null,null,null,null,"結算日期","2009-07-06"]
[null,null,null,null,null,null,null,null,null,null,null,"."]
[null,null,null,null,"資料"]
["編號","股票代號","股票名稱","買賣方式"," 買入股數"," 賣出股數"," 買入總成本","賣出淨額"," 未平倉股數","收盤股價","持股市值","損益小計"]
["1101-1",1101,"台 泥","融資",18000,null,234333.45,0,18000,{"$f":"IF(A5=\"\",\"\",VLOOKUP(B5,股票收盤資料區,5,0))","v":32.200000000000003},{"$f":"IF(A5=\"\",\"\",I5*J5)","v":579600},{"$f":"IF(A5=\"\",\"\",IF(D5=\"普通\",H5+K5*(1-券商手續費率-證券交易稅率)-G5,IF(D5=\"融資\",H5+K5*(1-券商手續費率-證券交易稅率)-G5-I5/VLOOKUP(A5,交易內容,6,0)*VLOOKUP(A5,交易內容,14,0)*融資利率*IF($L$1-VLOOKUP(A5,交易內容,2,0)<2,1,$L$1-VLOOKUP(A5,交易內容,2,0))/365,H5-K5*(1+券商手續費率)-G5+I5/VLOOKUP(A5,交易內容,8,0)*(VLOOKUP(A5,交易內容,19,0)+VLOOKUP(A5,交易內容,20,0))*擔保品保證金利率*IF($L$1-VLOOKUP(A5,交易內容,2,0)<2,1,$L$1-VLOOKUP(A5,交易內容,2,0))/365)))","v":342166.17616438359}]
["1104-1",1104,"環 泥","融券",9000,9000,108151.09677123287,89529.75,0,15,{"$f":"IF(A6=\"\",\"\",I6*J6)","v":0},-18621.346771232871]
["1217-1",1217,"愛之味","融券",null,5000,0,39791,5000,11.95,59750,-20017.980281506851]
["2002-1",2002,"中 鋼","融券",5000,10000,125149.15830273973,308380.25,5000,28.4,142000,41125.297354794515]
["2301-0",2301,"光寶科","普通",17000,1000,525748.125,31858.400000000001,16000,29.25,468000,-27960.625]
["2303-0",2303,"聯 電","普通",10000,5000,220313.5,99557.5,5000,10.95,54750,-66248.268749999988]
["2303-1",2303,"聯 電","融券",5000,9000,90109.56180821918,179059.5,4000,10.95,43800,45124.899575342453]
["2330-0",2330,"台積電","普通",3000,null,129183.825,0,3000,54.4,163200,33294.014999999999]
["2330-1",2330,"台積電","融資",23000,23000,921311,964397.34760273981,0,54.4,0,43086.347602739814]
["2330-2",2330,"台積電","融資",13000,13000,546778.05000000005,549936.03407534247,0,54.4,0,3157.9840753424214]
["2356-0",2356,"英業達","普通",21000,3000,357508.72499999998,53761.05,18000,19.899999999999999,358200,52867.289999999979]
["2801-1",2801,"彰 銀","融資",14000,14000,238339.15,348399.5075342466,0,14.95,0,110060.35753424661]
["2801-2",2801,"彰 銀","融資",15000,null,255363.375,0,15000,14.95,224250,-32997.692208904104]
["5301-0",5301,"祥裕電","普通",8000,null,56079.8,0,8000,{"$f":"IF(A18=\"\",\"\",VLOOKUP(B18,股票收盤資料區,5,0))","v":3.13},25040,-31150.602000000003]
[null,null,null,null,null,null,null,null,null,"",{"$f":"IF(A19=\"\",\"\",I19*J19)","v":""},""]
[null,null,null,null,null,null,null,null,null,"","",""]
[null,null,null,null,null,null,null,null,null,"","",""]
[null,null,null,null,null,null,null,null,null,"","",""]
[null,null,null,null,null,null,null,null,null,"","",""]
[null,null,null,null,null,null,null,null,null,"","",""]
[null,null,null,null,null,null,null,null,null,"","",""]
[null,null,null,null,null,null,null,null,null,"","",""]
[null,null,null,null,null,null,null,null,null,"","",""]
[null,null,null,null,null,null,null,null,null,"","",""]
[null,null,null,null,null,null,null,null,null,"","",""]
[null,null,null,null,null,null,null,null,null,{"$f":"IF(LEN(A30)>2,VLOOKUP(B30,股票收盤資料區,5,0),IF(AND(A30=\"\",J29>0),J29,\"\"))","v":""},"損益彙總",{"$f":"SUM(L5:L29)","v":473885.85229520564}]
[null,null,null,null,null,null,null,null,null,null,"總報酬率",{"$f":"L30/交易紀錄!T51","v":0.17396690612893012}]