{"text_format":"1","workbook":"xlsx","n_sheets":4,"sheets":["收盤行情","財務比率","統計圖表","總分比較圖表"],"not_rendered":{"charts":4,"images":0,"macros":1,"external_links":0,"defined_names":8,"comments":0,"pivot_tables":0},"unopened":[{"sheet":"統計圖表","index":2,"reason":"not_a_worksheet"},{"sheet":"總分比較圖表","index":3,"reason":"not_a_worksheet"}],"bounds":{"document_bytes":16777216,"sheet_cells":100000,"rows_first":2000,"rows_last":500,"rows_between":2000,"halvings":0,"cell_chars":16384,"cell_head_chars":4096},"cells_cut":0,"cells_raw":0,"read":"whole","date_system":"1900"}

{"sheet":"收盤行情","index":0,"n_rows":1378,"n_cols":27,"rows_kept":1378,"cut":false,"hidden":false,"merged":[[0,0,1,8],[2,2,2,3]]}
["報價日期 : 2009/7/1下午 02:00:00 "]
[]
["代號 ","名稱","漲跌",null,"收盤 ","開盤","最高 ","最低 ","總量"]
[15,"富 邦","▲",0.05,6.31,6.25,6.31,6.2,97]
[50,"台灣50","▲",0.99,45.45,44.48,45.65,44.45,11807]
[51,"中100","▲",0.49,24.41,24,24.5,24,211]
[52,"富邦IT","▲",0.5,27.75,27.4,27.75,27.4,65]
[53,"寶電子","▲",0.48,20.309999999999999,19.739999999999998,20.34,19.739999999999998,228]
[54,"台商50","▲",0.45,16.260000000000002,15.95,16.27,15.95,182]
[55,"寶金融","▲",0.39,11.58,11.26,11.59,11.24,3116]
[56,"高股息","▲",0.36,19.62,19.350000000000001,19.7,19.350000000000001,172]
[57,"FB摩台","▲",0.44,24.04,23.9,24.04,23.83,22]
[58,"FB發達","▲",0.6,25.7,25.7,25.7,25.7,1]
[59,"FB金融","▲",0.48,23.88,23.8,23.88,23.33,39]
[60,"新台灣","▲",0.54,22.4,21.99,22.4,21.9,106]
[1000,"加 權","▲",146.81,6578.97,6445.85,6593.78,6433.69,3789961]
[1001,"不含金","▲",116.62,5494.63,5386.13,5507.48,5376.35,3789961]
[1002,"水泥類","▲",5.0599999999999996,431.44,427.8,434.69,424.38,3789961]
[1003,"食品類","▲",9.6,608.44000000000005,602.74,609.47,599.66,3789961]
[1004,"塑化類","▲",8.1199999999999992,528.94000000000005,522.92999999999995,531.86,520.5,3789961]
[1005,"紡織類","▲",5.9,345.93,341.97,347.96,336.36,3789961]
[1006,"機電類","▲",31.59,1449.05,1417.85,1451.78,1414.69,3789961]
[1007,"造紙類","▲",6.16,170.73,164.46,170.99,164.31,3789961]
[1008,"營建類","▲",13.83,278.98,267.99,279.18,267.99,3789961]
[1009,"金融類","▲",23.34,812.1,793.33,813.53,791.35,3789961]
[1010,"不含電","▲",214.971,9453.91,9278.2099999999991,9477.91,9264.1090000000004,3789961]
[1011,"水 泥","▲",1.44,109.67,108.65,110.48,107.78,21996]
[1012,"食 品","▲",9.6,608.44000000000005,602.74,609.47,599.66,69887]
[1013,"塑 膠","▲",1.59,147.72999999999999,146.72999999999999,149.06,145.9,80886]
[1014,"紡 織","▲",5.9,345.93,341.97,347.96,336.36,77379]
[1015,"電 機","▲",1.01,63.67,62.86,63.67,62.7,32157]
[1016,"電 器","▲",0.69,40.270000000000003,39.67,40.39,39.67,42850]
[1017,"化生醫","▲",1.74,87.3,85.86,87.33,85.57,63792]
[1018,"玻 璃","▲",0.21,43.9,43.71,44.29,43.28,2759,null,null,null,null,null,null,null,null,null,null,null,null,null,null,null,{"$f":"MATCH(4000,$A$1:$A$1500,0)-MATCH(1101,$A$1:$A$1500,0)-10","v":734}]
[1019,"造 紙","▲",6.16,170.73,164.46,170.99,164.31,31399,null,{"$f":"LARGE(K$46:K$725,$Y$35)","v":-118.87},-166.73,-11.41,-5.78,-77.08,0.01,18.38,0.01,6,22.52,null,null,null,null,{"$f":"$Y$34*0.9","v":660.6}]
[1020,"鋼 鐵","▲",1.54,96.8,95.37,96.9,95.2,94373,null,{"$f":"LARGE(K$46:K$725,$Y$36)","v":-17.43},-23.42,-3.1,-1.65,-53.58,0.05,80.63,11.25,15.66,139.69,null,null,null,null,{"$f":"$Y$34*0.8","v":587.20000000000005}]
[1021,"橡 膠","▲",5.89,173.74,168.68,173.74,167.74,28489,null,{"$f":"LARGE(K$46:K$725,$Y$37)","v":-7.49},-8.09,-1.28,-0.68,-43.66,7.0000000000000007E-2,107.95,17.399999999999999,23.41,207.81,null,null,null,null,{"$f":"$Y$34*0.7","v":513.79999999999995}]
[1022,"汽 車","▲",3.86,102.86,99.01,103.05,98.9,70346,null,{"$f":"LARGE(K$46:K$725,$Y$38)","v":-1.98},0,0,0.03,-37.03,0.09,134.87,23.85,34.07,260,null,null,null,null,{"$f":"$Y$34*0.6","v":440.4}]
[1023,"電 子","▲",5.7,259.75,254.11,260.26,253.53,1651454,null,{"$f":"LARGE(K$46:K$725,$Y$39)","v":0.97},2.62,0.56000000000000005,0.43,-31.4,0.12,157.97,29.48,44.5,339.6,null,null,null,null,{"$f":"$Y$34*0.5","v":367}]
[1025,"營 造","▲",13.83,278.98,267.99,279.18,267.99,259700,null,{"$f":"LARGE(K$46:K$725,$Y$40)","v":2.4700000000000002},5.0999999999999996,1.08,0.77,-24.05,0.15,187.7,34.71,55.36,474.74,null,null,null,null,{"$f":"$Y$34*0.4","v":293.60000000000002}]
[1026,"運 輸","▲",1.1100000000000001,85.81,84.94,85.83,84.66,93063,null,{"$f":"LARGE(K$46:K$725,$Y$41)","v":4.9000000000000004},7.96,1.84,1.1499999999999999,-15.78,0.19,234.99,40.17,70.61,699.11,null,null,null,null,{"$f":"$Y$34*0.3","v":220.2}]
[1027,"觀 光","▲",1.94,130.09,128.11000000000001,130.26,127.29,6699,null,{"$f":"LARGE(K$46:K$725,$Y$42)","v":8.4},13.56,2.64,1.71,-4.66,0.25,310.23,47.44,94.73,1103.3900000000001,null,null,null,null,{"$f":"$Y$34*0.2","v":146.80000000000001}]
[1028,"金 融","▲",23.34,812.1,793.33,813.53,791.35,723551,null,{"$f":"LARGE(K$46:K$725,$Y$43)","v":15.98},24.29,4.47,2.81,8.91,0.43,470.21,55.9,137.24,2376.7399999999998,null,null,null,null,{"$f":"$Y$34*0.1","v":73.400000000000006}]
[1029,"百 貨","▲",1.89,122.47,120.93,123.23,120.59,52026]
[1099,"其 他","▲",1.77,114.49,113.24,114.6,113.1,66053,null,"營業利益率","稅前淨利率","股東權益報酬率","資產報酬率","營收成長率","流動比率","負債比率","總資產週轉率(次)","員工平均營業額(千元)","負債對淨值比率"]
[1101,"台 泥","▲",0.3,31.7,31.45,32.15,31.2,12731,{"$f":"A46&B46","v":"1101台 泥"},-1.57,3.03,0.25,0.26,-12.09,0.05,88.78,26.27,35.630000000000003,223.1]
[1102,"亞 泥","▲",0.65,35.65,35.200000000000003,35.9,34.9,5829,{"$f":"A47&B47","v":"1102亞 泥"},17.46,67.37,2.38,1.72,-3.64,0.03,143.63999999999999,31.49,45.97,3681.88]
[1103,"嘉 泥","▲",0.15,15.25,15.1,15.5,14.9,1028,"1103嘉 泥",1.49,-10.99,-0.2,-0.06,-1.95,0.03,156.16,34.46,52.59,910.33]
[1104,"環 泥","▲",0.05,14.95,14.8,14.95,14.7,826,"1104環 泥",-2.62,-4.32,-0.49,-0.26,-15.25,0.04,72.64,30.92,44.75,449.58]
[1107,"建 台","▼",-0.05,1.18,1.2,1.2,1.18,3,"1107建 台",-145.87,-354.28,"N/A",-0.84,-67.92,0,11.9,112.84,-878.68,-48.4]
[1108,"幸 福","▲",0.05,7.13,7.04,7.15,7.03,355,"1108幸 福",4.79,2.33,0.33,0.28999999999999998,-25.71,7.0000000000000007E-2,75.69,50.33,101.31,166]
[1109,"信 大",null,0,9.44,9.44,9.4600000000000009,9.36,188,"1109信 大",10.69,12.88,0.66,0.61,-24.05,0.05,1547.4,7.92,8.6,317.38]
[1110,"東 泥","▲",0.25,11.7,11.6,11.9,11.45,1039,"1110東 泥",7.43,10.01,0.43,0.37,-7.91,0.04,267.77,13.64,15.8,169.19]
[1201,"味 全","▲",1.25,37.6,36.299999999999997,37.700000000000003,35.9,13386,"1201味 全",7.78,6.57,3.46,1.67,12.72,0.26,140.58000000000001,52.72,111.53,131.1]
[1203,"味 王","▲",1,26.6,25.8,26.6,25.4,3162,"1203味 王",25.79,30.08,7.1,4.9000000000000004,115.73,0.17,144.72999999999999,24.69,32.78,542.55999999999995]
[1210,"大 成","▲",1.6,36.25,34.85,36.450000000000003,34.85,5124,"1210大 成",9.77,11.61,5,3.47,-8.84,0.37,177.28,28.33,39.54,450.11]
[1213,"大 飲","▲",0.1,8.7100000000000009,8.6,8.74,8.6,37,"1213大 飲",2.41,3.89,0.72,0.56000000000000005,5.7,0.2,227.35,24.43,32.33,221.99]
[1215,"卜 蜂","▲",0.7,17.3,16.45,17.649999999999999,16.45,5396,"1215卜 蜂",6.11,5.73,5.15,3.31,-1.88,0.76,239.71,31.06,45.05,259.10000000000002]
[1216,"統 一","▲",0.2,34,33.6,34.25,33.6,7604,"1216統 一",4.93,21.28,3.54,2.31,-16.45,0.11,105.37,37.159999999999997,59.14,911.23]
[1217,"愛之味","▲",0.1,11.35,11.25,11.5,11.2,11939,"1217愛之味",1.07,10.29,1.94,1.29,-2.67,0.12,108.68,42.52,73.97,332.91]
[1218,"泰 山","▲",0.25,12,11.95,12.25,11.9,5686,"1218泰 山",3.9,2.73,1.29,0.76,4.97,0.2,113.18,57.85,137.24,221.23]
[1219,"福 壽","▲",0.25,11.6,11.55,11.9,11.4,4076,"1219福 壽",2.16,3.35,1.66,1.1000000000000001,-6.86,0.41,386.9,35.880000000000003,55.95,252.83]
[1220,"台 榮",null,0,6.12,6.16,6.2,6.1,114,"1220台 榮",-0.73,-6.85,-1.96,-1.46,-32.61,0.24,279.49,24.19,31.91,276.43]
[1225,"福懋油","▲",0.65,12.95,12.6,13.15,12.6,4935,"1225福懋油",3.81,2.5499999999999998,1.7,0.92,-15.78,0.44,237.9,52.14,108.96,316.13]
[1227,"佳 格","▲",0.2,29.6,29.4,29.8,29,1013,"1227佳 格",21.67,18.600000000000001,6.72,5.26,35.909999999999997,0.39,258.31,20.78,26.24,515.65]
[1229,"聯 華","▲",0.85,15.2,14.45,15.2,14.4,3575,"1229聯 華",3.44,5.33,0.23,0.22,-29.53,0.04,126.18,22.34,28.76,516.16999999999996]
[1231,"聯華食","▲",0.05,12.1,12.1,12.25,12,252,"1231聯華食",1.05,2.36,1.05,0.7,-3.67,0.36,261.39,38.130000000000003,61.63,299.19]
[1232,"大統益","▲",0.6,36.4,37.049999999999997,37.049999999999997,36.049999999999997,626,"1232大統益",5.57,7.41,6.11,4.41,-27.43,0.78,214.39,27.29,37.54,240.01]
[1233,"天 仁","▲",0.05,34.65,34.6,35.1,34.5,70,"1233天 仁",13.44,14.56,4.47,3.31,-3.76,0.27,303.13,24.4,32.28,143.68]
[1234,"黑 松","▲",0.1,16.399999999999999,16.3,16.45,16.100000000000001,1732,"1234黑 松",2.85,9.17,0.61,0.55000000000000004,5.05,7.0000000000000007E-2,357.79,10.92,12.26,418.85]
[1235,"興 泰","▼",-0.8,35,35.799999999999997,35.799999999999997,35,7,"1235興 泰",-4.75,-10.26,-1.25,-0.76,-32.5,0.1,259.54000000000002,28.81,40.47,518.58000000000004]
[1236,"宏 亞","▲",0.35,16.8,16.8,16.8,16.45,102,"1236宏 亞",11.3,15.01,4.41,2.91,-16.36,0.25,171.52,31.1,45.14,142.33000000000001]
[1301,"臺 塑","▲",0.3,58.8,58.6,59.3,57.9,7838,"1301臺 塑",4.62,9.82,1.59,1.1599999999999999,-36.76,0.12,263.69,31.23,45.41,325.37]
[1303,"南 亞","▲",0.6,43.2,43,43.75,42.65,5445,"1303南 亞",0.86,-13.62,-1.53,-0.89,-50.57,0.09,267.06,34.71,53.17,382.41]
[1304,"臺 聚","▲",0.15,14.75,14.6,14.85,14.5,5182,"1304臺 聚",10.52,20,3.29,2.5099999999999998,-38.880000000000003,0.16,309.44,25.37,33.99,1042.8900000000001]
[1305,"華 夏","▲",0.25,11.85,11.6,11.95,11.5,8248,"1305華 夏",8.16,19.559999999999999,5.79,3.17,-37.729999999999997,0.18,248.68,46.15,85.71,207.9]
[1307,"三 芳","▲",0.35,27.7,27.3,27.75,27.3,130,"1307三 芳",3.6,22.54,6.39,3.85,9.6300000000000008,0.16,117.33,39.17,64.400000000000006,314.5]
[1308,"亞 聚","▲",0.4,20.3,20,20.45,20,1568,"1308亞 聚",16.61,23.98,3.8,3.29,-40.479999999999997,0.17,440.56,14.4,16.829999999999998,1019.42]
[1309,"臺達化","▲",0.08,7.93,7.99,8.02,7.85,980,"1309臺達化",1.22,11.76,5.17,2.57,-34.06,0.26,156.75,53.29,114.08,332.51]
[1310,"台 苯","▲",0.15,11.7,11.6,11.7,11.5,3076,"1310台 苯",16.54,15.55,6.51,4.68,-38.450000000000003,0.3,112.86,30.82,44.55,738.74]
{"$rows_left_out":1299}
{"sheet":"財務比率","index":1,"n_rows":72,"n_cols":21,"rows_kept":72,"cut":false,"hidden":false,"merged":[[44,0,44,12],[16,1,16,10],[25,1,25,10],[31,1,31,10],[40,1,40,10],[0,0,0,12],[1,0,43,0],[1,12,43,12],[12,13,13,13],[3,13,3,20],[5,13,8,13],[10,13,11,13],[1,1,1,11],[2,1,2,11],[3,1,3,10]]}
[]
[null,"台積電(2330)"]
[null,"單位:％",null,null,null,null,null,null,null,null,null,null,null,{"$f":"INDEX(收盤行情!A46:A1500,O3)","v":2330},273]
[null,"獲利能力",null,null,null,null,null,null,null,null,null,null,null,{"$f":"B2","v":"台積電(2330)"}]
[null,"期別","98.1Q","97.4Q","97.3Q","97.2Q","97.1Q","96.4Q","96.3Q","96.2Q",null,null,null,"年度季別","財務比率",{"$f":"C5","v":"98.1Q"},{"$f":"D5","v":"97.4Q"},{"$f":"G5","v":"97.1Q"},{"$f":"C5","v":"98.1Q"},{"$f":"D5","v":"97.4Q"},{"$f":"G5","v":"97.1Q"}]
[null,"營業毛利率",20.88,32.380000000000003,46.35,45.97,43.84,47.39,45.62,42.4,null,null,null,"獲利能力","營業利益率",{"$f":"INDEX($A$1:$G$45,7,3)","v":8.24},{"$f":"INDEX($A$1:$G$45,7,4)","v":21.38},{"$f":"INDEX($A$1:$G$45,7,7)","v":34.51},{"$f":"LOOKUP(P6,$N$19:$N$28,$O$19:$O$28)","v":8},{"$f":"LOOKUP(Q6,$N$19:$N$28,$O$19:$O$28)","v":10},{"$f":"LOOKUP(R6,$N$19:$N$28,$O$19:$O$28)","v":10}]
[null,"營業利益率",8.24,21.38,36.630000000000003,36.06,34.51,40.17,37.520000000000003,34.17,null,null,null,null,"稅前淨利率",{"$f":"INDEX($A$1:$G$45,8,3)","v":2},{"$f":"INDEX($A$1:$G$45,8,4)","v":21.17},{"$f":"INDEX($A$1:$G$45,8,7)","v":36.85},{"$f":"LOOKUP(P7,$N$19:$N$28,$O$19:$O$28)","v":6},{"$f":"LOOKUP(Q7,$N$19:$N$28,$O$19:$O$28)","v":10},{"$f":"LOOKUP(R7,$N$19:$N$28,$O$19:$O$28)","v":10}]
[null,"稅前淨利率",2,21.17,38.03,37.619999999999997,36.85,42.93,39.31,38.17,null,null,null,null,"股東權益報酬率",{"$f":"INDEX($A$1:$G$45,14,3)","v":0.33},{"$f":"INDEX($A$1:$G$45,14,4)","v":2.65},{"$f":"INDEX($A$1:$G$45,14,7)","v":5.65},5,7,8]
[null,"稅後淨利率",4.1500000000000004,20.46,33.93,33.61,33.020000000000003,37.9,35.130000000000003,34.979999999999997,null,null,null,null,"資產報酬率",{"$f":"INDEX($A$1:$G$45,15,3)","v":0.3},{"$f":"INDEX($A$1:$G$45,15,4)","v":2.33},{"$f":"INDEX($A$1:$G$45,15,7)","v":4.99},5,6,8]
[null,"每股淨值(元)",18.79,18.59,18.03,17.11,19.899999999999999,19.03,18.989999999999998,17.84,null,null,null,"經營績效","營收成長率",{"$f":"INDEX($A$1:$G$45,19,3)","v":-55.93},{"$f":"INDEX($A$1:$G$45,19,4)","v":-33.15},{"$f":"INDEX($A$1:$G$45,19,7)","v":34.549999999999997},2,2,10]
[null,"每股營業額(元)",1.47,2.37,3.52,3.34,3.33,3.56,3.38,2.85,null,null,null,"償債能力","流動比率",{"$f":"INDEX($A$1:$G$45,28,3)","v":462.24},{"$f":"INDEX($A$1:$G$45,28,4)","v":338.7},{"$f":"INDEX($A$1:$G$45,28,7)","v":369.92},10,10,10]
[null,"每股營業利益(元)",0.12,0.51,1.29,1.2,1.1499999999999999,1.43,1.27,0.97,null,null,null,null,"負債比率",{"$f":"INDEX($A$1:$G$45,30,3)","v":9.76},{"$f":"INDEX($A$1:$G$45,30,4)","v":11.87},{"$f":"INDEX($A$1:$G$45,30,7)","v":11.99},{"$f":"IF(P12<0,1,LOOKUP(P12,$P$30:$P$39,$Q$30:$Q$39))","v":10},{"$f":"IF(Q12<0,1,LOOKUP(Q12,$P$30:$P$39,$Q$30:$Q$39))","v":10},10]
[null,"每股稅前淨利(元)",0.03,0.5,1.32,1.26,1.23,1.48,1.29,1.05,null,null,null,"經營能力","總資產週轉率(次)",{"$f":"INDEX($A$1:$G$45,37,3)","v":7.0000000000000007E-2},{"$f":"INDEX($A$1:$G$45,37,4)","v":0.11},{"$f":"INDEX($A$1:$G$45,37,7)","v":0.15},{"$f":"LOOKUP(P13,$P41:$P50,$Q41:$Q50)","v":2},{"$f":"LOOKUP(Q13,$P41:$P50,$Q41:$Q50)","v":2},{"$f":"LOOKUP(R13,$P41:$P50,$Q41:$Q50)","v":2}]
[null,"股東權益報酬率",0.33,2.65,6.75,6.04,5.65,6.98,6.25,5.0999999999999996,null,null,null,null,"員工平均營業額(千元)",{"$f":"INDEX($A$1:$G$45,38,3)","v":19},{"$f":"INDEX($A$1:$G$45,38,4)","v":30},{"$f":"INDEX($A$1:$G$45,38,7)","v":42},{"$f":"LOOKUP(P14,$P$52:$P$61,$Q$52:$Q$61)","v":3},{"$f":"LOOKUP(Q14,$P$52:$P$61,$Q$52:$Q$61)","v":4},5]
[null,"資產報酬率",0.3,2.33,5.43,4.9000000000000004,4.99,6.18,5.13,4.22,null,null,null,"資本結構","負債對淨值比率",{"$f":"INDEX($A$1:$G$45,43,3)","v":10.82},{"$f":"INDEX($A$1:$G$45,43,4)","v":13.47},{"$f":"INDEX($A$1:$G$45,43,7)","v":13.62},{"$f":"IF(P15<0,1,LOOKUP(P15,$P$63:$P$72,$Q$63:$Q$72))","v":10},{"$f":"IF(Q15<0,1,LOOKUP(Q15,$P$63:$P$72,$Q$63:$Q$72))","v":10},10]
[null,"每股稅後淨利(元)",0.06,0.48,1.18,1.1200000000000001,1.1000000000000001,1.31,1.1499999999999999,0.97,null,null,null,null,"總分/等級",{"$f":"LOOKUP(S16,R19:R23,S19:S23)","v":"☆☆☆"},{"$f":"LOOKUP(T16,R19:R23,S19:S23)","v":"☆☆☆☆"},{"$f":"LOOKUP(U16,R19:R23,S19:S23)","v":"☆☆☆☆☆"},{"$f":"SUM(S6:S15)","v":61},{"$f":"SUM(T6:T15)","v":71},{"$f":"SUM(U6:U15)","v":83}]
[null,"經營績效"]
[null,"期別","98.1Q","97.4Q","97.3Q","97.2Q","97.1Q","96.4Q","96.3Q","96.2Q",null,null,null,"營業利益率","分數","流動比率","分數","總分","等級"]
[null,"營收成長率",-55.93,-33.15,4.2300000000000004,17.489999999999998,34.549999999999997,23.06,6.18,-10.31,null,null,null,-999999,1,-999999,1,10,"☆"]
[null,"營業利益成長率",-89.48,-64.42,1.74,23.97,60.19,33.28,-1.79,-28.82,null,null,null,{"$f":"收盤行情!K35","v":-118.87},2,{"$f":"收盤行情!P35","v":0.01},2,28,"☆☆"]
[null,"稅前淨利成長率",-97.61,-67.040000000000006,0.85,15.8,57.87,33.270000000000003,-1.75,-23.29,null,null,null,{"$f":"收盤行情!K36","v":-17.43},3,{"$f":"收盤行情!P36","v":0.05},3,46,"☆☆☆"]
[null,"稅後淨利成長率",-94.46,-63.91,0.67,12.9,49.39,23.55,-6.52,-25.05,null,null,null,{"$f":"收盤行情!K37","v":-7.49},4,{"$f":"收盤行情!P37","v":7.0000000000000007E-2},4,64,"☆☆☆☆"]
[null,"總資產成長率",-7.78,-2.0299999999999998,-6.28,-3.7,-2.19,-3.8,3.05,6.64,null,null,null,{"$f":"收盤行情!K38","v":-1.98},5,{"$f":"收盤行情!P38","v":0.09},5,82,"☆☆☆☆☆"]
[null,"淨值成長率",-5.45,-2.2000000000000002,-7.82,-5.87,-3.66,-4.1100000000000003,4.1900000000000004,5.38,null,null,null,{"$f":"收盤行情!K39","v":0.97},6,{"$f":"收盤行情!P39","v":0.12},6]
[null,"固定資產成長率",-13.84,-6.52,-5.0199999999999996,-0.49,5.91,2.77,2.59,6.64,null,null,null,{"$f":"收盤行情!K40","v":2.4700000000000002},7,{"$f":"收盤行情!P40","v":0.15},7]
[null,"償債能力",null,null,null,null,null,null,null,null,null,null,null,{"$f":"收盤行情!K41","v":4.9000000000000004},8,{"$f":"收盤行情!P41","v":0.19},8]
[null,"期別","98.1Q","97.4Q","97.3Q","97.2Q","97.1Q","96.4Q","96.3Q","96.2Q",null,null,null,{"$f":"收盤行情!K42","v":8.4},9,{"$f":"收盤行情!P42","v":0.25},9]
[null,"流動比率",462.24,338.7,275.37,161.03,369.92,397.94,383.27,182.31,null,null,null,{"$f":"收盤行情!K43","v":15.98},10,{"$f":"收盤行情!P43","v":0.43},10]
[null,"速動比率",411.12,304.12,234.3,141.26,319.93,335.73,325.52,159.78,null,null,null,"稅前淨利率","分數","負債比率","分數"]
[null,"負債比率",9.76,11.87,13.19,25.79,11.99,11.72,11.73,24.08,null,null,null,-999999,1,0,10]
[null,"利息保障倍數",19.38,145.99,387.19,363.83,354.88,290.97000000000003,229.01,187.57,null,null,null,{"$f":"收盤行情!L35","v":-166.73},2,{"$f":"收盤行情!Q35","v":18.38},9]
[null,"經營能力",null,null,null,null,null,null,null,null,null,null,null,{"$f":"收盤行情!L36","v":-23.42},3,{"$f":"收盤行情!Q36","v":80.63},8]
[null,"期別","98.1Q","97.4Q","97.3Q","97.2Q","97.1Q","96.4Q","96.3Q","96.2Q",null,null,null,{"$f":"收盤行情!L37","v":-8.09},4,{"$f":"收盤行情!Q37","v":107.95},7]
[null,"應收帳款週轉率(次)",2.61,2,2.14,2.25,2.2400000000000002,2.27,2.33,2.2400000000000002,null,null,null,{"$f":"收盤行情!L38","v":0},5,{"$f":"收盤行情!Q38","v":134.87},6]
[null,"存貨週轉率(次)",2.31,2.5499999999999998,2.4,2.31,2.38,2.23,2.15,2.02,null,null,null,{"$f":"收盤行情!L39","v":2.62},6,{"$f":"收盤行情!Q39","v":157.97},5]
[null,"固定資產週轉率(次)",0.18,0.27,0.39,0.36,0.36,0.38,0.36,0.32,null,null,null,{"$f":"收盤行情!L40","v":5.0999999999999996},7,{"$f":"收盤行情!Q40","v":187.7},4]
[null,"總資產週轉率(次)",7.0000000000000007E-2,0.11,0.16,0.15,0.15,0.16,0.15,0.12,null,null,null,{"$f":"收盤行情!L41","v":7.96},8,{"$f":"收盤行情!Q41","v":234.99},3]
[null,"員工平均營業額(千元)",19,30,44,41,42,4427,4213,3541,null,null,null,{"$f":"收盤行情!L42","v":13.56},9,{"$f":"收盤行情!Q42","v":310.23},2]
[null,"淨值週轉率",0.08,0.13,0.2,0.18,0.17,0.18,0.18,0.15,null,null,null,{"$f":"收盤行情!L43","v":24.29},10,{"$f":"收盤行情!Q43","v":470.21},1]
[null,null,null,null,null,null,null,null,null,null,null,null,null,"股東權益報酬率","分數","總資產週轉率(次)","分數"]
[null,"資本結構",null,null,null,null,null,null,null,null,null,null,null,-999999,1,-999999,1]
[null,"期別","98.1Q","97.4Q","97.3Q","97.2Q","97.1Q","96.4Q","96.3Q","96.2Q",null,null,null,{"$f":"收盤行情!M35","v":-11.41},2,{"$f":"收盤行情!R35","v":0.01},2]
[null,"負債對淨值比率",10.82,13.47,15.19,34.75,13.62,13.28,13.29,31.72,null,null,null,{"$f":"收盤行情!M36","v":-3.1},3,{"$f":"收盤行情!R36","v":11.25},3]
[null,"長期資金適合率",239.77,219.72,206.01,189.45,218.56,213.63,215.39,203.64,null,null,null,{"$f":"收盤行情!M37","v":-1.28},4,{"$f":"收盤行情!R37","v":17.399999999999999},4]
[null,null,null,null,null,null,null,null,null,null,null,null,null,{"$f":"收盤行情!M38","v":0},5,{"$f":"收盤行情!R38","v":23.85},5]
[null,null,null,null,null,null,null,null,null,null,null,null,null,{"$f":"收盤行情!M39","v":0.56000000000000005},6,{"$f":"收盤行情!R39","v":29.48},6]
[null,null,null,null,null,null,null,null,null,null,null,null,null,{"$f":"收盤行情!M40","v":1.08},7,{"$f":"收盤行情!R40","v":34.71},7]
[null,null,null,null,null,null,null,null,null,null,null,null,null,{"$f":"收盤行情!M41","v":1.84},8,{"$f":"收盤行情!R41","v":40.17},8]
[null,null,null,null,null,null,null,null,null,null,null,null,null,{"$f":"收盤行情!M42","v":2.64},9,{"$f":"收盤行情!R42","v":47.44},9]
[null,null,null,null,null,null,null,null,null,null,null,null,null,{"$f":"收盤行情!M43","v":4.47},10,{"$f":"收盤行情!R43","v":55.9},10]
[null,null,null,null,null,null,null,null,null,null,null,null,null,"資產報酬率","分數","員工平均營業額(千元)","分數"]
[null,null,null,null,null,null,null,null,null,null,null,null,null,-999999,1,-999999,1]
[null,null,null,null,null,null,null,null,null,null,null,null,null,{"$f":"收盤行情!N35","v":-5.78},2,{"$f":"收盤行情!S35","v":6},2]
[null,null,null,null,null,null,null,null,null,null,null,null,null,{"$f":"收盤行情!N36","v":-1.65},3,{"$f":"收盤行情!S36","v":15.66},3]
[null,null,null,null,null,null,null,null,null,null,null,null,null,{"$f":"收盤行情!N37","v":-0.68},4,{"$f":"收盤行情!S37","v":23.41},4]
[null,null,null,null,null,null,null,null,null,null,null,null,null,{"$f":"收盤行情!N38","v":0.03},5,{"$f":"收盤行情!S38","v":34.07},5]
[null,null,null,null,null,null,null,null,null,null,null,null,null,{"$f":"收盤行情!N39","v":0.43},6,{"$f":"收盤行情!S39","v":44.5},6]
[null,null,null,null,null,null,null,null,null,null,null,null,null,{"$f":"收盤行情!N40","v":0.77},7,{"$f":"收盤行情!S40","v":55.36},7]
[null,null,null,null,null,null,null,null,null,null,null,null,null,{"$f":"收盤行情!N41","v":1.1499999999999999},8,{"$f":"收盤行情!S41","v":70.61},8]
[null,null,null,null,null,null,null,null,null,null,null,null,null,{"$f":"收盤行情!N42","v":1.71},9,{"$f":"收盤行情!S42","v":94.73},9]
[null,null,null,null,null,null,null,null,null,null,null,null,null,{"$f":"收盤行情!N43","v":2.81},10,{"$f":"收盤行情!S43","v":137.24},10]
[null,null,null,null,null,null,null,null,null,null,null,null,null,"營收成長率","分數","負債對淨值比率","分數"]
[null,null,null,null,null,null,null,null,null,null,null,null,null,-999999,1,0,10]
[null,null,null,null,null,null,null,null,null,null,null,null,null,{"$f":"收盤行情!O35","v":-77.08},2,{"$f":"收盤行情!T35","v":22.52},9]
[null,null,null,null,null,null,null,null,null,null,null,null,null,{"$f":"收盤行情!O36","v":-53.58},3,{"$f":"收盤行情!T36","v":139.69},8]
[null,null,null,null,null,null,null,null,null,null,null,null,null,{"$f":"收盤行情!O37","v":-43.66},4,{"$f":"收盤行情!T37","v":207.81},7]
[null,null,null,null,null,null,null,null,null,null,null,null,null,{"$f":"收盤行情!O38","v":-37.03},5,{"$f":"收盤行情!T38","v":260},6]
[null,null,null,null,null,null,null,null,null,null,null,null,null,{"$f":"收盤行情!O39","v":-31.4},6,{"$f":"收盤行情!T39","v":339.6},5]
[null,null,null,null,null,null,null,null,null,null,null,null,null,{"$f":"收盤行情!O40","v":-24.05},7,{"$f":"收盤行情!T40","v":474.74},4]
[null,null,null,null,null,null,null,null,null,null,null,null,null,{"$f":"收盤行情!O41","v":-15.78},8,{"$f":"收盤行情!T41","v":699.11},3]
[null,null,null,null,null,null,null,null,null,null,null,null,null,{"$f":"收盤行情!O42","v":-4.66},9,{"$f":"收盤行情!T42","v":1103.3900000000001},2]
[null,null,null,null,null,null,null,null,null,null,null,null,null,{"$f":"收盤行情!O43","v":8.91},10,{"$f":"收盤行情!T43","v":2376.7399999999998},1]