{"text_format":"1","workbook":"xlsx","n_sheets":5,"sheets":["收盤行情","費率","交易紀錄","損益彙算","持股市值與損益圖表"],"not_rendered":{"charts":2,"images":0,"macros":1,"external_links":0,"defined_names":15,"comments":0,"pivot_tables":1},"unopened":[{"sheet":"持股市值與損益圖表","index":4,"reason":"not_a_worksheet"}],"bounds":{"document_bytes":16777216,"sheet_cells":100000,"rows_first":2000,"rows_last":500,"rows_between":2000,"halvings":0,"cell_chars":16384,"cell_head_chars":4096},"cells_cut":0,"cells_raw":0,"read":"whole","date_system":"1900"}

{"sheet":"收盤行情","index":0,"n_rows":1432,"n_cols":9,"rows_kept":1432,"cut":false,"hidden":false,"merged":[[0,0,1,8],[2,2,2,3]]}
["報價日期 : 2011/7/24下午 02:00:00 "]
[]
["代號 ","名稱","漲跌",null,"收盤 ","開盤","最高 ","最低 ","總量"]
[15,"富 邦","▲",0.04,8.24,8.1999999999999993,8.25,8.1999999999999993,538]
[50,"台灣50","▲",0.4,61,60.85,61.15,60.8,22648]
[51,"中100","▲",0.5,32.4,32.14,32.409999999999997,32.14,186]
[52,"富邦IT","▲",0.6,33.869999999999997,33.5,33.869999999999997,33.5,4]
[53,"寶電子","▲",7.0000000000000007E-2,25.47,25.7,25.7,25.46,30]
[54,"台商50","▲",0.18,22.69,22.51,22.81,22.51,54]
[55,"寶金融","▲",0.16,14.69,14.55,14.7,14.51,3254]
[56,"高股息","▲",0.3,28.5,28.28,28.6,28.28,254]
[57,"FB摩台","▲",0.25,33.82,33.799999999999997,33.89,33.76,354]
[58,"FB發達","▲",0.12,37.57,37.549999999999997,37.57,37.549999999999997,4]
[59,"FB金融","▲",0.21,32.21,32.1,32.22,31.96,46]
[60,"新台灣","▲",0.01,35.159999999999997,35.07,35.26,35.07,53]
[61,"寶滬深","▲",0.15,17.760000000000002,17.61,17.78,17.559999999999999,5911]
[80,"恒中國","▼",-448,0,0,0,0,0]
[81,"恒香港","▼",-810,0,0,0,0,0]
[1000,"加 權","▲",48.179000000000002,8765.3189999999995,8770.9500000000007,8794.4789999999994,8741.09,4993923]
[1001,"不含金","▲",37.619999999999997,7354.28,7364.18,7379.27,7342.51,0]
[1002,"水泥類","▲",14.15,696.49,682.9,711.11,680.39,0]
[1003,"食品類","▲",23.47,1037.31,1020.26,1041.6199999999999,1020.06,0]
[1004,"塑化類","▲",10.99,1025.6500000000001,1018.75,1025.79,1017.01,0]
[1005,"紡織類","▲",2.3199999999999998,501.06,499.62,505.04,498.82,0]
[1006,"機電類","▲",3.38,1749.68,1761.6,1763.01,1749.63,0]
[1007,"造紙類","▲",0.82,201.7,201.87,202.89,201.33,0]
[1008,"營建類","▲",4.6399999999999997,361.54,359.9,362.76,359.64,0]
[1009,"金融類","▲",8.34,1056.8800000000001,1052.9000000000001,1060.18,1046.25,0]
[1010,"不含電","▲",131.51900000000001,14153.279,14074.25,14175.109,14042.84,0]
[1011,"水 泥","▲",6,157.88999999999999,152.76,161.54,152.63999999999999,56561]
[1012,"食 品","▲",23.47,1037.31,1020.26,1041.6199999999999,1020.06,119671]
[1013,"塑 膠","▲",4.12,302.14999999999998,298.75,302.14999999999998,298.08,103223]
[1014,"紡 織","▲",2.3199999999999998,501.06,499.62,505.04,498.82,129335]
[1015,"電 機","▲",2.7,132.81,131.30000000000001,133.16,130.29,56246]
[1016,"電 器","▲",0.08,53.75,53.99,54.18,53.46,31985]
[1017,"化生醫","▲",1.25,139.32,139.16999999999999,139.96,138.78,101443]
[1018,"玻 璃","▼",-3.38,107.47,109.44,109.53,105.93,23081]
[1019,"造 紙","▲",0.82,201.7,201.87,202.89,201.33,28106]
[1020,"鋼 鐵","▼",-1.1000000000000001,113.09,114.26,114.26,112.94,118881]
[1021,"橡 膠","▼",-1.46,328.71,332.79,332.79,328.68,60115]
[1022,"汽 車","▲",3.81,206.16,204.42,206.32,202.21,61390]
[1023,"電 子","▲",0.43,309.62,311.89999999999998,312.14,309.62,1399037]
[1025,"營 造","▲",4.6399999999999997,361.54,359.9,362.76,359.64,187209]
[1026,"運 輸","▼",-0.16,100.67,101.03,101.31,100.22,107080]
[1027,"觀 光","▲",0.78,152.84,152.46,153.81,152.46,5433]
[1028,"金 融","▲",8.34,1056.8800000000001,1052.9000000000001,1060.18,1046.25,538405]
[1029,"百 貨","▼",-0.09,263.45999999999998,266.74,267.22000000000003,262.99,63540]
[1099,"其 他","▲",1.22,169.55,168.15,169.94,168.15,63517]
[1101,"台 泥","▲",2.1,48.4,46.4,49.45,46.4,23190]
[1102,"亞 泥","▲",1.55,46.75,45.7,48.3,45.45,16682]
[1103,"嘉 泥","▲",1.3,20.3,19,20.3,19,11811]
[1104,"環 泥","▲",0.05,18.350000000000001,18.45,18.75,18.100000000000001,2642]
[1107,"建 台","▲",0.02,2.2200000000000002,2.2000000000000002,2.2200000000000002,2.2000000000000002,93]
[1108,"幸 福","▲",0.11,7.31,7.2,7.39,7.17,1467]
[1109,"信 大","▲",0.15,11.5,11.4,11.6,11.4,276]
[1110,"東 泥","▲",0.35,12.5,12.15,12.55,12.15,493]
[1201,"味 全","▲",0.6,37.6,37.1,38.1,37.049999999999997,20402]
[1203,"味 王","▲",0.4,23.25,23,23.4,22.95,268]
[1210,"大 成","▲",1.2,36.4,35.299999999999997,36.799999999999997,35.299999999999997,9872]
[1213,"大 飲","▲",0.2,29.9,30.2,30.3,29.85,563]
{"$rows_left_out":1373}
{"sheet":"費率","index":1,"n_rows":9,"n_cols":6,"rows_kept":9,"cut":false,"hidden":false,"merged":[]}
["券商手續費率",{"$f":"D1/1000000","v":1.4250000000000001E-3},null,1425,null,"買賣方式"]
["證券交易稅率",{"$f":"D2/1000","v":3.0000000000000001E-3},null,3,null,"普通"]
["上市融資成數",{"$f":"D3/100","v":0.6},null,60,null,"融資"]
["上櫃融資成數",{"$f":"D4/100","v":0.5},null,50,null,"融券"]
["上市融券成數",{"$f":"D5/100","v":0.9},null,90]
["上櫃融券成數",{"$f":"D6/100","v":0.9},null,90]
["融資利率",{"$f":"D7/10000","v":6.6500000000000004E-2},null,665]
["融券手續費率",{"$f":"D8/10000","v":8.0000000000000004E-4},null,8]
["擔保品保證金利率",{"$f":"D9/1000","v":3.0000000000000001E-3},null,3]

{"sheet":"交易紀錄","index":2,"n_rows":80,"n_cols":23,"rows_kept":80,"cut":false,"hidden":false,"merged":[]}
["編號","日期","股票代號","股票名稱","買賣方式","買入股數","買入單價","賣出股數","賣出單價","總價","手續費","證交稅","融資自備款","融資金額","融資利息費用","融券手續費","融券利息收入","買入總成本","保證金","(融券擔保品)賣出淨額",null,"買賣方式","買入股數"]
["2330-1","2011-06-05",2330,{"$f":"IF(C2=\"\",\"\",VLOOKUP(C2,股票收盤資料區,2,FALSE))","v":"台積電"},"融資",23000,40,null,null,{"$f":"IF(C2=\"\",\"\",F2*G2+H2*I2)","v":920000},{"$f":"IF(C2=\"\",\"\",J2*券商手續費率)","v":1311},{"$f":"IF(C2=\"\",\"\",IF(H2>0,J2*證券交易稅率,\"\"))","v":""},{"$f":"IF(C2=\"\",\"\",IF(AND(E2=\"融資\",F2>0),J2-N2,\"\"))","v":368000},{"$f":"IF(C2=\"\",\"\",IF(AND(E2=\"融資\",F2>0),1000*INT(J2*IF(ISNA(VLOOKUP(C2,上櫃代號,1,FALSE)),上市融資成數,上櫃融資成數)/1000),\"\"))","v":552000},{"$f":"IF(C2=\"\",\"\",IF(AND(E2=\"融資\",H2>0),H2/VLOOKUP(A2,交易內容,6,0)*VLOOKUP(A2,交易內容,14,0)*融資利率*IF(B2-VLOOKUP(A2,交易內容,2,0)<2,0,B2-VLOOKUP(A2,交易內容,2,0))/365,\"\"))","v":""},{"$f":"IF(C2=\"\",\"\",IF(AND(E2=\"融券\",H2>0),J2*融券手續費率,\"\"))","v":""},{"$f":"IF(C2=\"\",\"\",IF(AND(E2=\"融券\",F2>0),F2/VLOOKUP(A2,交易內容,8,0)*(VLOOKUP(A2,交易內容,19,0)+VLOOKUP(A2,交易內容,20,0))*擔保品保證金利率*IF(B2-VLOOKUP(A2,交易內容,2,0)<2,0,B2-VLOOKUP(A2,交易內容,2,0))/365,\"\"))","v":""},{"$f":"IF(C2=\"\",\"\",IF(AND(E2=\"融券\",F2>0),J2+K2-Q2,IF(F2>0,J2+K2,\"\")))","v":921311},{"$f":"IF(C2=\"\",\"\",IF(AND(E2=\"融券\",H2>0),J2*IF(ISNA(VLOOKUP(C2,上櫃代號,1,0)),上市融券成數,上櫃融券成數),\"\"))","v":""},{"$f":"IF(C2=\"\",\"\",IF(H2>0,IF(E2=\"融券\",J2-K2-L2-P2,IF(E2=\"融資\",J2-K2-L2-O2,J2-K2-L2)),\"\"))","v":""},null,"普通",">0"]
["2330-1","2011-06-07",2330,"台積電","融資",null,null,10000,41,{"$f":"IF(C3=\"\",\"\",F3*G3+H3*I3)","v":410000},584.25,1230,{"$f":"IF(C3=\"\",\"\",IF(AND(E3=\"融資\",F3>0),J3-N3,\"\"))","v":""},"",87.452054794520549,"","",{"$f":"IF(C3=\"\",\"\",IF(AND(E3=\"融券\",F3>0),J3+K3-Q3,IF(F3>0,J3+K3,\"\")))","v":""},"",{"$f":"IF(C3=\"\",\"\",IF(H3>0,IF(E3=\"融券\",J3-K3-L3-P3,IF(E3=\"融資\",J3-K3-L3-O3,J3-K3-L3)),\"\"))","v":408098.29794520547}]
["2330-1","2011-06-09",2330,"台積電","融資",null,null,13000,43,559000,{"$f":"IF(C4=\"\",\"\",J4*券商手續費率)","v":796.57500000000005},1677,{"$f":"IF(C4=\"\",\"\",IF(AND(E4=\"融資\",F4>0),J4-N4,\"\"))","v":""},"",227.37534246575342,"","","","",{"$f":"IF(C4=\"\",\"\",IF(H4>0,IF(E4=\"融券\",J4-K4-L4-P4,IF(E4=\"融資\",J4-K4-L4-O4,J4-K4-L4)),\"\"))","v":556299.04965753434}]
["2301-0","2011-06-11",2301,"光寶科","普通",2000,30,null,null,60000,85.5,"","","","","","",60085.5,"",{"$f":"IF(C5=\"\",\"\",IF(H5>0,IF(E5=\"融券\",J5-K5-L5-P5,IF(E5=\"融資\",J5-K5-L5-O5,J5-K5-L5)),\"\"))","v":""}]
["2301-0","2011-06-13",2301,"光寶科","普通",null,null,1000,32,{"$f":"IF(C6=\"\",\"\",F6*G6+H6*I6)","v":32000},45.6,96,"","","","","","","",31858.400000000001]
["1101-1","2011-06-15",1101,"台 泥","融資",18000,33,null,null,594000,846.45,"",238000,356000,"","","",594846.44999999995,"",""]
["1104-1","2011-05-17",1104,"環 泥","融券",null,null,9000,10,90000,128.25,270,"","","",72,"","",81000,89529.75]
["1104-1","2011-05-19",1104,"環 泥","融券",9000,12,null,null,108000,153.9,"","","","","",2.8032287671232878,108151.09677123287,"",""]
["2801-1","2011-05-21",2801,"彰 銀","融資",14000,17,null,null,238000,339.15000000000003,"",96000,142000,"","","",238339.15,"",""]
["2801-1","2011-05-23",2801,"彰 銀","融資",null,null,14000,25,350000,498.75,1050,"","",51.742465753424661,"","","","",348399.5075342466]
["1217-1","2011-05-25",1217,"愛之味","融券",null,null,5000,8,40000,57,120,"","","",32,"","",36000,39791]
["2002-1","2011-05-27",2002,"中 鋼","融券",null,null,10000,31,310000,441.75,930,"","","",248,"","",279000,308380.25]
["2356-0","2011-05-29",2356,"英業達","普通",21000,17,null,null,357000,508.72500000000002,"","","","","","",357508.72499999998,"",""]
["5301-0","2011-05-31",5301,"祥裕電","普通",8000,7,null,null,56000,79.8,"","","","","","",56079.8,"",""]
["2356-0","2011-06-02",2356,"英業達","普通",null,null,3000,18,54000,76.95,162,"","","","","","","",53761.05]
["2801-2","2011-06-04",2801,"彰 銀","融資",15000,17,null,null,255000,363.375,"",102000,153000,"","","",255363.375,"",""]
["2303-1","2011-06-06",2303,"聯 電","融券",null,null,9000,20,180000,256.5,540,"","","",144,"","",162000,179059.5]
["2002-1","2011-06-08",2002,"中 鋼","融券",5000,25,null,null,125000,178.125,"","","","","",28.966697260273971,125149.15830273973,"",""]
["2301-0","2011-06-10",2301,"光寶科","普通",15000,31,null,null,465000,662.625,"","","","","","",465662.625,"",""]
["2330-2","2011-06-12",2330,"台積電","融資",13000,42,null,null,546000,778.05000000000007,"",219000,327000,"","","",546778.05000000005,"",""]
["2330-2","2011-06-14",2330,"台積電","融資",null,null,13000,42.5,552500,787.3125,1657.5,"","",119.15342465753425,"","","","",549936.03407534247]
["2330-0","2011-06-16",2330,"台積電","普通",3000,43,null,null,129000,183.82500000000002,"","","","","","",129183.825,"",""]
["2303-1","2011-06-18",2303,"聯 電","融券",5000,18,null,null,90000,128.25,"","","","","",18.688191780821921,90109.56180821918,"",""]
["2303-0","2011-06-20",2303,"聯 電","普通",10000,22,null,null,220000,313.5,"","","","","","",220313.5,"",""]
["2303-0","2011-06-22",2303,"聯 電","普通",null,null,5000,20,{"$f":"IF(C26=\"\",\"\",F26*G26+H26*I26)","v":100000},142.5,300,"","","","","","","",99557.5]
[null,null,null,{"$f":"IF(C27=\"\",\"\",VLOOKUP(C27,股票代碼區,2,FALSE))","v":""},null,null,null,null,null,{"$f":"IF(C27=\"\",\"\",F27*G27+H27*I27)","v":""},{"$f":"IF(C27=\"\",\"\",J27*券商手續費率)","v":""},{"$f":"IF(C27=\"\",\"\",IF(H27>0,J27*證券交易稅率,\"\"))","v":""},"","","",{"$f":"IF(C27=\"\",\"\",IF(AND(E27=\"融券\",H27>0),J27*融券手續費率,\"\"))","v":""},"","","",""]
[null,null,null,"",null,null,null,null,null,"","","","","","","","","","",""]
[null,null,null,"",null,null,null,null,null,"","","","","","","","","","",""]
[null,null,null,"",null,null,null,null,null,"","","","","","","","","","",""]
[null,null,null,"",null,null,null,null,null,"","","","","","","","","","",""]
[null,null,null,"",null,null,null,null,null,"","","","","","","","","","",""]
[null,null,null,"",null,null,null,null,null,"","","","","","","","","","",""]
[null,null,null,"",null,null,null,null,null,"","","","",{"$f":"IF(C34=\"\",\"\",IF(AND(E34=\"融資\",F34>0),1000*INT(J34*IF(ISNA(VLOOKUP(C34,上櫃代號,1,FALSE)),上市融資成數,上櫃融資成數)/1000),\"\"))","v":""},{"$f":"IF(C34=\"\",\"\",IF(AND(E34=\"融資\",H34>0),H34/VLOOKUP(A34,交易內容,6,0)*VLOOKUP(A34,交易內容,14,0)*融資利率*IF(B34-VLOOKUP(A34,交易內容,2,0)<2,0,B34-VLOOKUP(A34,交易內容,2,0))/365,\"\"))","v":""},"",{"$f":"IF(C34=\"\",\"\",IF(AND(E34=\"融券\",F34>0),F34/VLOOKUP(A34,交易內容,8,0)*(VLOOKUP(A34,交易內容,19,0)+VLOOKUP(A34,交易內容,20,0))*擔保品保證金利率*IF(B34-VLOOKUP(A34,交易內容,2,0)<2,0,B34-VLOOKUP(A34,交易內容,2,0))/365,\"\"))","v":""},"",{"$f":"IF(C34=\"\",\"\",IF(AND(E34=\"融券\",H34>0),J34*IF(ISNA(VLOOKUP(C34,上櫃代號,1,0)),上市融券成數,上櫃融券成數),\"\"))","v":""},""]
[null,null,null,"",null,null,null,null,null,"","","","","","","","","","",""]
[null,null,null,"",null,null,null,null,null,"","","","","","","","","","",""]
[null,null,null,"",null,null,null,null,null,"","","","","","","","","","",""]
[null,null,null,"",null,null,null,null,null,"","","","","","","","","","",""]
[null,null,null,"",null,null,null,null,null,"","","","","","","","","","",""]
[null,null,null,"",null,null,null,null,null,"","","","","","","","","","",""]
[null,null,null,"",null,null,null,null,null,"","","","","","","","","","",""]
[null,null,null,"",null,null,null,null,null,"","","","","","","","","","",""]
[null,null,null,"",null,null,null,null,null,"","","","","","","","","","",""]
[null,null,null,"",null,null,null,null,null,"","","","","","","","","","",""]
[null,null,null,"",null,null,null,null,null,"","","","","","","","","","",""]
[null,null,null,"",null,null,null,null,null,"","","","","","","","","","",""]
[null,null,null,"",null,null,null,null,null,"","","","","","","","","","",""]
[null,null,null,"",null,null,null,null,null,"","","","","","","","","","",""]
[null,null,null,"",null,null,null,null,null,"","","","","","","","","","",""]
[null,null,null,null,null,null,null,null,null,"","","","","","","","","","",""]
[null,null,null,null,null,null,null,null,null,{"$f":"DSUM(交易內容,10,V1:W2)","v":1287000},null,null,{"$f":"SUM(M2:M50)","v":1023000},null,null,null,{"$f":"IF(C51=\"\",\"\",IF(E51<>\"券買\",\"\",(F51*VLOOKUP(VLOOKUP(A51,費率!$Q$21:$T$29,4,FALSE),交易內容,7,FALSE)*IF(ISERROR(VLOOKUP(C51,上櫃代號,1,FALSE)),上市融券成數,上櫃融券成數)+((F51/VLOOKUP(VLOOKUP(A51,費率!$Q$21:$T$29,4,FALSE),交易內容,6,FALSE))*VLOOKUP(VLOOKUP(A51,費率!$Q$21:$T$29,4,FALSE),交易內容,18,FALSE)))*擔保金保證金利率*IF(B51-VLOOKUP(A51,費率!$Q$21:$T$29,4,FALSE)<2,1,(B51-VLOOKUP(A51,費率!$Q$21:$T$29,4,FALSE)))/365))","v":""},null,{"$f":"SUM(S2:S50)","v":558000},{"$f":"J51+M51+S51","v":2868000}]
[null,null,null,null,null,null,null,null,null,null,null,null,null,null,null,null,{"$f":"IF(C52=\"\",\"\",IF(E52<>\"券買\",\"\",(F52*VLOOKUP(VLOOKUP(A52,費率!$Q$21:$T$29,4,FALSE),交易內容,7,FALSE)*IF(ISERROR(VLOOKUP(C52,上櫃代號,1,FALSE)),上市融券成數,上櫃融券成數)+((F52/VLOOKUP(VLOOKUP(A52,費率!$Q$21:$T$29,4,FALSE),交易內容,6,FALSE))*VLOOKUP(VLOOKUP(A52,費率!$Q$21:$T$29,4,FALSE),交易內容,18,FALSE)))*擔保金保證金利率*IF(B52-VLOOKUP(A52,費率!$Q$21:$T$29,4,FALSE)<2,1,(B52-VLOOKUP(A52,費率!$Q$21:$T$29,4,FALSE)))/365))","v":""}]
[null,null,null,null,null,null,null,null,null,null,null,null,null,null,null,null,{"$f":"IF(C53=\"\",\"\",IF(E53<>\"券買\",\"\",(F53*VLOOKUP(VLOOKUP(A53,費率!$Q$21:$T$29,4,FALSE),交易內容,7,FALSE)*IF(ISERROR(VLOOKUP(C53,上櫃代號,1,FALSE)),上市融券成數,上櫃融券成數)+((F53/VLOOKUP(VLOOKUP(A53,費率!$Q$21:$T$29,4,FALSE),交易內容,6,FALSE))*VLOOKUP(VLOOKUP(A53,費率!$Q$21:$T$29,4,FALSE),交易內容,18,FALSE)))*擔保金保證金利率*IF(B53-VLOOKUP(A53,費率!$Q$21:$T$29,4,FALSE)<2,1,(B53-VLOOKUP(A53,費率!$Q$21:$T$29,4,FALSE)))/365))","v":""}]
[null,null,null,null,null,null,null,null,null,null,null,null,null,null,null,null,{"$f":"IF(C54=\"\",\"\",IF(E54<>\"券買\",\"\",(F54*VLOOKUP(VLOOKUP(A54,費率!$Q$21:$T$29,4,FALSE),交易內容,7,FALSE)*IF(ISERROR(VLOOKUP(C54,上櫃代號,1,FALSE)),上市融券成數,上櫃融券成數)+((F54/VLOOKUP(VLOOKUP(A54,費率!$Q$21:$T$29,4,FALSE),交易內容,6,FALSE))*VLOOKUP(VLOOKUP(A54,費率!$Q$21:$T$29,4,FALSE),交易內容,18,FALSE)))*擔保金保證金利率*IF(B54-VLOOKUP(A54,費率!$Q$21:$T$29,4,FALSE)<2,1,(B54-VLOOKUP(A54,費率!$Q$21:$T$29,4,FALSE)))/365))","v":""}]
[null,null,null,null,null,null,null,null,null,null,null,null,null,null,null,null,{"$f":"IF(C55=\"\",\"\",IF(E55<>\"券買\",\"\",(F55*VLOOKUP(VLOOKUP(A55,費率!$Q$21:$T$29,4,FALSE),交易內容,7,FALSE)*IF(ISERROR(VLOOKUP(C55,上櫃代號,1,FALSE)),上市融券成數,上櫃融券成數)+((F55/VLOOKUP(VLOOKUP(A55,費率!$Q$21:$T$29,4,FALSE),交易內容,6,FALSE))*VLOOKUP(VLOOKUP(A55,費率!$Q$21:$T$29,4,FALSE),交易內容,18,FALSE)))*擔保金保證金利率*IF(B55-VLOOKUP(A55,費率!$Q$21:$T$29,4,FALSE)<2,1,(B55-VLOOKUP(A55,費率!$Q$21:$T$29,4,FALSE)))/365))","v":""}]
[null,null,null,null,null,null,null,null,null,null,null,null,null,null,null,null,{"$f":"IF(C56=\"\",\"\",IF(E56<>\"券買\",\"\",(F56*VLOOKUP(VLOOKUP(A56,費率!$Q$21:$T$29,4,FALSE),交易內容,7,FALSE)*IF(ISERROR(VLOOKUP(C56,上櫃代號,1,FALSE)),上市融券成數,上櫃融券成數)+((F56/VLOOKUP(VLOOKUP(A56,費率!$Q$21:$T$29,4,FALSE),交易內容,6,FALSE))*VLOOKUP(VLOOKUP(A56,費率!$Q$21:$T$29,4,FALSE),交易內容,18,FALSE)))*擔保金保證金利率*IF(B56-VLOOKUP(A56,費率!$Q$21:$T$29,4,FALSE)<2,1,(B56-VLOOKUP(A56,費率!$Q$21:$T$29,4,FALSE)))/365))","v":""}]
[null,null,null,null,null,null,null,null,null,null,null,null,null,null,null,null,{"$f":"IF(C57=\"\",\"\",IF(E57<>\"券買\",\"\",(F57*VLOOKUP(VLOOKUP(A57,費率!$Q$21:$T$29,4,FALSE),交易內容,7,FALSE)*IF(ISERROR(VLOOKUP(C57,上櫃代號,1,FALSE)),上市融券成數,上櫃融券成數)+((F57/VLOOKUP(VLOOKUP(A57,費率!$Q$21:$T$29,4,FALSE),交易內容,6,FALSE))*VLOOKUP(VLOOKUP(A57,費率!$Q$21:$T$29,4,FALSE),交易內容,18,FALSE)))*擔保金保證金利率*IF(B57-VLOOKUP(A57,費率!$Q$21:$T$29,4,FALSE)<2,1,(B57-VLOOKUP(A57,費率!$Q$21:$T$29,4,FALSE)))/365))","v":""}]
[null,null,null,null,null,null,null,null,null,null,null,null,null,null,null,null,{"$f":"IF(C58=\"\",\"\",IF(E58<>\"券買\",\"\",(F58*VLOOKUP(VLOOKUP(A58,費率!$Q$21:$T$29,4,FALSE),交易內容,7,FALSE)*IF(ISERROR(VLOOKUP(C58,上櫃代號,1,FALSE)),上市融券成數,上櫃融券成數)+((F58/VLOOKUP(VLOOKUP(A58,費率!$Q$21:$T$29,4,FALSE),交易內容,6,FALSE))*VLOOKUP(VLOOKUP(A58,費率!$Q$21:$T$29,4,FALSE),交易內容,18,FALSE)))*擔保金保證金利率*IF(B58-VLOOKUP(A58,費率!$Q$21:$T$29,4,FALSE)<2,1,(B58-VLOOKUP(A58,費率!$Q$21:$T$29,4,FALSE)))/365))","v":""}]
[null,null,null,null,null,null,null,null,null,null,null,null,null,null,null,null,{"$f":"IF(C59=\"\",\"\",IF(E59<>\"券買\",\"\",(F59*VLOOKUP(VLOOKUP(A59,費率!$Q$21:$T$29,4,FALSE),交易內容,7,FALSE)*IF(ISERROR(VLOOKUP(C59,上櫃代號,1,FALSE)),上市融券成數,上櫃融券成數)+((F59/VLOOKUP(VLOOKUP(A59,費率!$Q$21:$T$29,4,FALSE),交易內容,6,FALSE))*VLOOKUP(VLOOKUP(A59,費率!$Q$21:$T$29,4,FALSE),交易內容,18,FALSE)))*擔保金保證金利率*IF(B59-VLOOKUP(A59,費率!$Q$21:$T$29,4,FALSE)<2,1,(B59-VLOOKUP(A59,費率!$Q$21:$T$29,4,FALSE)))/365))","v":""}]
[null,null,null,null,null,null,null,null,null,null,null,null,null,null,null,null,{"$f":"IF(C60=\"\",\"\",IF(E60<>\"券買\",\"\",(F60*VLOOKUP(VLOOKUP(A60,費率!$Q$21:$T$29,4,FALSE),交易內容,7,FALSE)*IF(ISERROR(VLOOKUP(C60,上櫃代號,1,FALSE)),上市融券成數,上櫃融券成數)+((F60/VLOOKUP(VLOOKUP(A60,費率!$Q$21:$T$29,4,FALSE),交易內容,6,FALSE))*VLOOKUP(VLOOKUP(A60,費率!$Q$21:$T$29,4,FALSE),交易內容,18,FALSE)))*擔保金保證金利率*IF(B60-VLOOKUP(A60,費率!$Q$21:$T$29,4,FALSE)<2,1,(B60-VLOOKUP(A60,費率!$Q$21:$T$29,4,FALSE)))/365))","v":""}]
{"$rows_left_out":21}
{"sheet":"損益彙算","index":3,"n_rows":31,"n_cols":12,"rows_kept":31,"cut":false,"hidden":false,"merged":[]}
[null,null,null,null,null,null,null,null,null,null,"結算日期","2011-07-24"]
[null,null,null,null,null,null,null,null,null,null,null,"."]
[null,null,null,null,"資料"]
["編號","股票代號","股票名稱","買賣方式"," 買入股數"," 賣出股數"," 買入總成本","賣出淨額"," 未平倉股數","收盤股價","持股市值","損益小計"]
["1101-1",1101,"台 泥","融資",18000,null,594846.44999999995,0,18000,{"$f":"IF(A5=\"\",\"\",VLOOKUP(B5,股票收盤資料區,5,0))","v":48.4},{"$f":"IF(A5=\"\",\"\",I5*J5)","v":871200},{"$f":"IF(A5=\"\",\"\",IF(D5=\"普通\",H5+K5*(1-券商手續費率-證券交易稅率)-G5,IF(D5=\"融資\",H5+K5*(1-券商手續費率-證券交易稅率)-G5-I5/VLOOKUP(A5,交易內容,6,0)*VLOOKUP(A5,交易內容,14,0)*融資利率*IF($L$1-VLOOKUP(A5,交易內容,2,0)<2,0,$L$1-VLOOKUP(A5,交易內容,2,0))/365,H5-K5*(1+券商手續費率)-G5+I5/VLOOKUP(A5,交易內容,8,0)*(VLOOKUP(A5,交易內容,19,0)+VLOOKUP(A5,交易內容,20,0))*擔保品保證金利率*IF($L$1-VLOOKUP(A5,交易內容,2,0)<2,0,$L$1-VLOOKUP(A5,交易內容,2,0))/365)))","v":269968.93931506848}]
["1104-1",1104,"環 泥","融券",9000,9000,108151.09677123287,89529.75,0,18.350000000000001,{"$f":"IF(A6=\"\",\"\",I6*J6)","v":0},-18621.346771232871]
["1217-1",1217,"愛之味","融券",null,5000,0,39791,5000,14,70000,-30271.373616438355]
["2002-1",2002,"中 鋼","融券",5000,10000,125149.15830273973,308380.25,5000,30.55,152750,30403.428650684917]
["2301-0",2301,"光寶科","普通",17000,1000,525748.125,31858.400000000001,16000,37.450000000000003,599200,102658.81500000006]
["2303-0",2303,"聯 電","普通",10000,5000,220313.5,99557.5,5000,13.4,67000,-54052.475000000006]
["2303-1",2303,"聯 電","融券",5000,9000,90109.56180821918,179059.5,4000,13.4,53600,35333.360405479449]
["2330-0",2330,"台積電","普通",3000,null,129183.825,0,3000,72,216000,85860.375000000015]
["2330-1",2330,"台積電","融資",23000,23000,921311,964397.34760273981,0,72,0,43086.347602739814]
["2330-2",2330,"台積電","融資",13000,13000,546778.05000000005,549936.03407534247,0,72,0,3157.9840753424214]
["2356-0",2356,"英業達","普通",21000,3000,357508.72499999998,53761.05,18000,14.2,255600,-49278.704999999958]
["2801-1",2801,"彰 銀","融資",14000,14000,238339.15,348399.5075342466,0,25.05,0,110060.35753424661]
["2801-2",2801,"彰 銀","融資",15000,null,255363.375,0,15000,25.05,375750,117330.16412671235]
["5301-0",5301,"祥裕電","普通",8000,null,56079.8,0,8000,{"$f":"IF(A18=\"\",\"\",VLOOKUP(B18,股票收盤資料區,5,0))","v":0},0,-56079.8]
[null,null,null,null,null,null,null,null,null,"",{"$f":"IF(A19=\"\",\"\",I19*J19)","v":""},""]
[null,null,null,null,null,null,null,null,null,"","",""]
[null,null,null,null,null,null,null,null,null,"","",""]
[null,null,null,null,null,null,null,null,null,"","",""]
[null,null,null,null,null,null,null,null,null,"","",""]
[null,null,null,null,null,null,null,null,null,"","",""]
[null,null,null,null,null,null,null,null,null,"","",""]
[null,null,null,null,null,null,null,null,null,"","",""]
[null,null,null,null,null,null,null,null,null,"","",""]
[null,null,null,null,null,null,null,null,null,"","",""]
[null,null,null,null,null,null,null,null,null,"","",""]
[null,null,null,null,null,null,null,null,null,{"$f":"IF(LEN(A30)>2,VLOOKUP(B30,股票收盤資料區,5,0),IF(AND(A30=\"\",J29>0),J29,\"\"))","v":""},"損益彙總",{"$f":"SUM(L5:L29)","v":589556.07132260292}]
[null,null,null,null,null,null,null,null,null,null,"總報酬率",{"$f":"L30/交易紀錄!T51","v":0.20556348372475694}]